Tetrasiloxane, decamethyl-
- Formula: C10H30O3Si4
- Molecular weight: 310.6854
- IUPAC Standard InChIKey: YFCGDEUVHLPRCZ-UHFFFAOYSA-N
- CAS Registry Number: 141-62-8
- Chemical structure:
View 3d structure (requires JavaScript / HTML 5) - Other names: Decamethyltetrasiloxane; [(CH3)3SiOSi(CH3)2]2O; CD3780; D3780; 1,1,1,3,3,5,5,7,7,7-Decamethyltetrasiloxane

Phase change data

Data compiled by: William E. Acree, Jr., James S. Chickos
Enthalpy of vaporization
ΔvapH (kJ/mol) | Temperature (K) | Method | Reference | Comment |
---|---|---|---|---|
48.2 | 358. | A | Stephenson and Malanowski, 1987 | Based on data from 343. to 454. K. See also Skorokhodov, Ditsent, et al., 1971. |
50.3 | 381. | EB | Flaningam, 1986 | Based on data from 366. to 479. K. |

Gas phase ion energetics data

Data compiled by: Sharon G. Lias, John E. Bartmess, Joel F. Liebman, John L. Holmes, Rhoda D. Levin, and W. Gary Mallard
Ionization energy determinations
IE (eV) | Method | Reference | Comment |
---|---|---|---|
10.24 | PE | Ermakov, Kirichenko, et al., 1982 | Vertical value |

Van Den Dool and Kratz RI, non-polar column, custom temperature program

Column type | Active phase | I | Reference | Comment |
---|---|---|---|---|
Capillary | VF-5MS | 1033. | Tret'yakov, 2008 | 30. m/0.25 mm/0.25 μm, He; Program: Multi-step temperature program; T(initial)=60C; T(final)=270C |

References

Stephenson and Malanowski, 1987
Stephenson, Richard M.; Malanowski, Stanislaw,
Handbook of the Thermodynamics of Organic Compounds, 1987, https://doi.org/10.1007/978-94-009-3173-2
. [all data]
Skorokhodov, Ditsent, et al., 1971
Skorokhodov, I.I.; Ditsent, V.E.; Teret'eva, N.A.; Zolotarev, M.N.,
Russ. J. Phys. Chem., 1971, 45, 6, 902. [all data]
Flaningam, 1986
Flaningam, Ora L.,
Vapor pressures of poly(dimethylsiloxane) oligomers,
J. Chem. Eng. Data, 1986, 31, 3, 266-272, https://doi.org/10.1021/je00045a002
. [all data]
Ermakov, Kirichenko, et al., 1982
Ermakov, A.I.; Kirichenko, E.A.; Pimkin, N.I.; Chizhov, Y.V.; Kleimenov, V.I.,
Photoelectronic spectra and electronic structure of organotri- and organotetrasiloxanes of linear and cyclic structure,
Zh. Strukt. Khim., 1982, 23, 61. [all data]
Tret'yakov, 2008
Tret'yakov, K.V.,
Retention Data. NIST Mass Spectrometry Data Center., NIST Mass Spectrometry Data Center, 2008. [all data]