Acetaldehyde, hydroxy-
- Formula: C2H4O2
- Molecular weight: 60.0520
- IUPAC Standard InChIKey: WGCNASOHLSPBMP-UHFFFAOYSA-N
- CAS Registry Number: 141-46-8
- Chemical structure:
View 3d structure (requires JavaScript / HTML 5) - Other names: Glycolaldehyde; Diose; Glycolic aldehyde; Hydroxyacetaldehyde; Methylol formaldehyde; Monomethylolformaldehyde; HOCH2CHO; Glycoaldehyde; NSC 67935; glycollaldehyde

Phase change data

Data compiled by: William E. Acree, Jr., James S. Chickos
Enthalpy of vaporization
ΔvapH (kJ/mol) | Temperature (K) | Reference | Comment |
---|---|---|---|
70. ± 5. | 288. | Petitjean, Reyes-Perez, et al., 2010 | Based on data from 273. to 304. K. |

Reaction thermochemistry data

Data compiled by: John E. Bartmess
Individual Reactions
C2H3O2- + =
By formula: C2H3O2- + H+ = C2H4O2
Quantity | Value | Units | Method | Reference | Comment |
---|---|---|---|---|---|
ΔrG° | >1536. ± 8.4 | kJ/mol | IMRB | Dawson and Nibbering, 1980 | gas phase; G3MP2B3 calculations put dGacid ca. 353 kcal/mol |

Henry's Law data

Data compiled by: Rolf Sander
Henry's Law constant (water solution)
kH(T) = k°H exp(d(ln(kH))/d(1/T) ((1/T) - 1/(298.15 K)))
k°H = Henry's law constant for solubility in water at 298.15 K (mol/(kg*bar))
d(ln(kH))/d(1/T) = Temperature dependence constant (K)
k°H (mol/(kg*bar)) | d(ln(kH))/d(1/T) (K) | Method | Reference | Comment |
---|---|---|---|---|
41000. | 4600. | M | N/A | missing citation list effective values that take into account hydration of the aldehydes: kH = ([RCHO] + [RCH(OH)2]) / p(RCHO) |

Gas phase ion energetics data

Data compiled as indicated in comments:
B - John E. Bartmess
LBLHLM - Sharon G. Lias, John E. Bartmess, Joel F. Liebman, John L. Holmes, Rhoda D. Levin, and W. Gary Mallard
Appearance energy determinations
Ion | AE (eV) | Other Products | Method | Reference | Comment |
---|---|---|---|---|---|
CH3O+ | 10.86 ± 0.05 | HCO | EI | Holmes and Lossing, 1984 | LBLHLM |
CH4O+[CH2OH2+] | 10.42 ± 0.05 | CO | EI | Holmes, Lossing, et al., 1982 | LBLHLM |
De-protonation reactions
C2H3O2- + =
By formula: C2H3O2- + H+ = C2H4O2
Quantity | Value | Units | Method | Reference | Comment |
---|---|---|---|---|---|
ΔrG° | >1536. ± 8.4 | kJ/mol | IMRB | Dawson and Nibbering, 1980 | gas phase; G3MP2B3 calculations put dGacid ca. 353 kcal/mol; B |

References

Petitjean, Reyes-Perez, et al., 2010
Petitjean, M.; Reyes-Perez, E.; Perez, D.; Mirabel, Ph.; Le Calve, S.,
Vapor Pressure Measurements of Hydroxyacetaldehyde and Hydroxyacetone in the Temperature Range (273 to 356) K,
J. Chem. Eng. Data, 2010, 55, 2, 852-855, https://doi.org/10.1021/je9004905
. [all data]
Dawson and Nibbering, 1980
Dawson, J.H.J.; Nibbering, N.M.M.,
The gas phase anionic chemistry of saturated and unsaturated aliphatic nitriles,
Int. J. Mass Spectrom. Ion Phys., 1980, 33, 3. [all data]
Holmes and Lossing, 1984
Holmes, J.L.; Lossing, F.P.,
Heats of formation of organic radicals from appearance energies,
Int. J. Mass Spectrom. Ion Processes, 1984, 58, 113. [all data]
Holmes, Lossing, et al., 1982
Holmes, J.L.; Lossing, F.P.; Terlouw, J.K.; Burgers, P.C.,
The radical cation [CH2OH2]+ and related stable gas phase ion-dipole complexes,
J. Am. Chem. Soc., 1982, 104, 2931. [all data]