1,3-Butadiene, 2-ethyl-3-methyl-
- Formula: C7H12
- Molecular weight: 96.1702
- IUPAC Standard InChIKey: PJXJBPMWCKMWLS-UHFFFAOYSA-N
- CAS Registry Number: 14145-44-9
- Chemical structure:
View 3d structure (requires JavaScript / HTML 5) - Permanent link for this species. Use this link for bookmarking this species for future reference.

Phase change data

Data compiled by: Thermodynamics Research Center, NIST Boulder Laboratories, Chris Muzny director
Quantity | Value | Units | Method | Reference | Comment |
---|---|---|---|---|---|
Tboil | 416. | K | N/A | Marvel and Fuller, 1952 | Uncertainty assigned by TRC = 3. K |

Gas phase ion energetics data

Data compiled as indicated in comments:
LLK - Sharon G. Lias, Rhoda D. Levin, and Sherif A. Kafafi
Ionization energy determinations
IE (eV) | Method | Reference | Comment |
---|---|---|---|
8.65 | PE | Masclet, Mouvier, et al., 1981 | Vertical value; LLK |

References

Marvel and Fuller, 1952
Marvel, C.S.; Fuller, J.A.,
J. Am. Chem. Soc., 1952, 74, 1506. [all data]
Masclet, Mouvier, et al., 1981
Masclet, P.; Mouvier, G.; Bocquet, J.F.,
Effets electroniques et effets steriques dus a la substitution alcoyle dans les dienes conjugues,
J. Chim. Phys., 1981, 78, 99. [all data]