Rhenium, pentacarbonylchloro-
- Formula: C5ClO5Re
- Molecular weight: 361.711
- IUPAC Standard InChIKey: JQUUAHKBIXPQAP-UHFFFAOYSA-M
- CAS Registry Number: 14099-01-5
- Chemical structure:
View 3d structure (requires JavaScript / HTML 5) - Other names: Rhenium pentacarbonyl chloride; Rhenium, pentacarbonylchloro-, (OC-6-22)-; Chloropentacarbonylrhenium; Chlororhenium pentacarbonyl; Pentacarbonylchlororhenium; Re(CO)5Cl

Gas phase thermochemistry data

Data compiled by: José A. Martinho Simões
Quantity | Value | Units | Method | Reference | Comment |
---|---|---|---|---|---|
ΔfH°gas | -875. ± 18. | kJ/mol | Review | Martinho Simões |

Condensed phase thermochemistry data

Data compiled by: José A. Martinho Simões
Quantity | Value | Units | Method | Reference | Comment |
---|---|---|---|---|---|
ΔfH°solid | -986. ± 18. | kJ/mol | Review | Martinho Simões |

Phase change data

Data compiled by: José A. Martinho Simões
Quantity | Value | Units | Method | Reference | Comment |
---|---|---|---|---|---|
ΔsubH° | 111. ± 2. | kJ/mol | HAL-HFC | Al-Takhin, Connor, et al., 1983 |

Gas phase ion energetics data

Data compiled as indicated in comments:
LLK - Sharon G. Lias, Rhoda D. Levin, and Sherif A. Kafafi
RDSH - Henry M. Rosenstock, Keith Draxl, Bruce W. Steiner, and John T. Herron
Ionization energy determinations
IE (eV) | Method | Reference | Comment |
---|---|---|---|
9.18 ± 0.03 | EI | Junk, Svec, et al., 1968 | RDSH |
9.06 | PE | Higginson, Lloyd, et al., 1975 | Vertical value; LLK |
8.80 | PE | Hall, 1975 | Vertical value; LLK |
9.02 | PE | Ceasar, Milazzo, et al., 1974 | Vertical value; LLK |
Appearance energy determinations
Ion | AE (eV) | Other Products | Method | Reference | Comment |
---|---|---|---|---|---|
COClRe+ | 16.84 | 4CO | EI | Junk, Svec, et al., 1968 | RDSH |
C2O2ClRe+ | 14.85 | 3CO | EI | Junk, Svec, et al., 1968 | RDSH |
C3O3ClRe+ | 11.92 | 2CO | EI | Junk, Svec, et al., 1968 | RDSH |
C4O4ClRe+ | 10.45 | CO | EI | Junk, Svec, et al., 1968 | RDSH |
ReCl+ | 19.27 | 5CO | EI | Junk, Svec, et al., 1968 | RDSH |
Re+ | 23.1 | ? | EI | Junk, Svec, et al., 1968 | RDSH |

References

Martinho Simões
Martinho Simões, J.A.,
Private communication (see http://webbook.nist.gov/chemistry/om/). [all data]
Al-Takhin, Connor, et al., 1983
Al-Takhin, G.; Connor, J.A.; Skinner, H.A.,
J. Organomet. Chem., 1983, 259, 313. [all data]
Junk, Svec, et al., 1968
Junk, G.A.; Svec, H.J.; Angelici, R.J.,
Electron impact studies of manganese and rhenium pentacarbonyl halides,
J. Am. Chem. Soc., 1968, 90, 5758. [all data]
Higginson, Lloyd, et al., 1975
Higginson, B.R.; Lloyd, D.R.; Evans, S.; Orchard, A.F.,
Photoelectron studies of metal carbonyls. Part 5. - Substituted group VIIA carbonyls,
J. Chem. Soc. Faraday Trans. 2, 1975, 71, 1913. [all data]
Hall, 1975
Hall, M.B.,
The use of spin-orbit coupling in the interpretation of photoelectron spectra. I. Application to substituted rhenium pentacarbonyls,
J. Am. Chem. Soc., 1975, 97, 2057. [all data]
Ceasar, Milazzo, et al., 1974
Ceasar, G.P.; Milazzo, P.; Cihonski, J.L.; Levenson, R.A.,
Photoelectron spectra of osmium and ruthenium tetroxide,
J. Am. Chem. Soc., 1974, 13, 3035. [all data]