1,4,7,10,13-Benzopentaoxacyclopentadecin, 2,3,5,6,8,9,11,12-octahydro-
- Formula: C14H20O5
- Molecular weight: 268.3056
- IUPAC Standard InChIKey: FNEPSTUXZLEUCK-UHFFFAOYSA-N
- CAS Registry Number: 14098-44-3
- Chemical structure:
View 3d structure (requires JavaScript / HTML 5) - Other names: Benzo[6]1,4,7,10,13-pentaoxacyclopentadecane; Benzo-15-crown-5; Benzo-15-crown-5 ether; Crown ether benzo-15-crown-5; Monobenzo-15-crown-5; 2,3-Benzo-15-crown-5; 2,3,5,6,8,9,11,12-Octahydro-1,4,7,10,13-benzopentaoxacyclopentadecin; Bis(1,4,7,10,13-benzopentaoxacyclopentadecin, 2,3,5,6,8,9,11,12-octahydro-)

Condensed phase thermochemistry data

Data compiled by: Hussein Y. Afeefy, Joel F. Liebman, and Stephen E. Stein
Quantity | Value | Units | Method | Reference | Comment |
---|---|---|---|---|---|
ΔfH°solid | -782.4 ± 4.7 | kJ/mol | Ccb | Vasil'ev, Borodin, et al., 1992 | Authors Hf298_condensed=-745.7±4.7 kJ/mol |
Quantity | Value | Units | Method | Reference | Comment |
ΔcH°solid | -7585.1 ± 6.2 | kJ/mol | Ccb | Vasil'ev, Borodin, et al., 1992 | Authors Hf298_condensed=-745.7±4.7 kJ/mol; Corresponding ΔfHºsolid = -782.3 kJ/mol (simple calculation by NIST; no Washburn corrections) |

Phase change data

Data compiled as indicated in comments:
TRC - Thermodynamics Research Center, NIST Boulder Laboratories, Chris Muzny director
AC - William E. Acree, Jr., James S. Chickos
Quantity | Value | Units | Method | Reference | Comment |
---|---|---|---|---|---|
Tfus | 354.1 | K | N/A | Solov'ev, Govorkova, et al., 1986 | Uncertainty assigned by TRC = 0.3 K; TRC |
Quantity | Value | Units | Method | Reference | Comment |
ΔvapH° | 98.9 ± 1.3 | kJ/mol | CGC | Nichols, Orf, et al., 2000 | AC |
Quantity | Value | Units | Method | Reference | Comment |
ΔsubH° | 128. ± 11. | kJ/mol | CGC-DSC | Nichols, Orf, et al., 2000 | AC |

Gas phase ion energetics data

Data compiled as indicated in comments:
LBLHLM - Sharon G. Lias, John E. Bartmess, Joel F. Liebman, John L. Holmes, Rhoda D. Levin, and W. Gary Mallard
Ionization energy determinations
IE (eV) | Method | Reference | Comment |
---|---|---|---|
8.0 | PE | Baker, Armen, et al., 1983 | Vertical value; LBLHLM |

References

Vasil'ev, Borodin, et al., 1992
Vasil'ev, V.P.; Borodin, V.A.; Kopnyshev, S.B.,
Standard enthalpies of formation of certain crown-ethers,
Russ. J. Phys. Chem. (Engl. Transl.), 1992, 66, 585-587, In original 1104. [all data]
Solov'ev, Govorkova, et al., 1986
Solov'ev, V.P.; Govorkova, L.V.; Raevskii, O.A.,
Determination of the Purity, Melting Point and Heat of Melting of Cyclic Polyethers,
Izv. Akad. Nauk SSSR, Ser. Khim., 1986, No. 3, 691-2. [all data]
Nichols, Orf, et al., 2000
Nichols, Gary; Orf, Jennifer; Reiter, Sarah M.; Chickos, James; Gokel, George W.,
The vaporization enthalpies of some crown and polyethers by correlation gas chromatography,
Thermochimica Acta, 2000, 346, 1-2, 15-28, https://doi.org/10.1016/S0040-6031(99)00405-0
. [all data]
Baker, Armen, et al., 1983
Baker, A.D.; Armen, G.H.; Funaro, S.,
Oral levels of crown ethers and related macrocycles studies by ultraviolet photoelectron spectroscopy: Relationship to complexation studies,
J. Chem. Soc. Dalton Trans., 1983, 2519. [all data]