Propane, 2-(ethenylthio)-2-methyl-
- Formula: C6H12S
- Molecular weight: 116.224
- IUPAC Standard InChIKey: QBBBUPLGCPJGMC-UHFFFAOYSA-N
- CAS Registry Number: 14094-13-4
- Chemical structure:
View 3d structure (requires JavaScript / HTML 5) - Permanent link for this species. Use this link for bookmarking this species for future reference.

Gas phase ion energetics data

Data compiled by: Sharon G. Lias, Rhoda D. Levin, and Sherif A. Kafafi
Ionization energy determinations
IE (eV) | Method | Reference |
---|---|---|
8.07 ± 0.01 | PI | Trofimov, Mel'der, et al., 1975 |

References

Trofimov, Mel'der, et al., 1975
Trofimov, B.A.; Mel'der, U.K.; Pikver, R.I.; Vyalykh, E.P.,
Ionization potentials of unsaturated and sulfides the participation of neighboring multiple bonds of heteroatoms in the stabilization of the radical cation,
Teor. Eksp. Khim., 1975, 11, 129. [all data]