Sulfoxide, isopropyl methyl-
- Formula: C4H10OS
- Molecular weight: 106.187
- IUPAC Standard InChIKey: KBGDIHYLFZNUNL-UHFFFAOYSA-N
- CAS Registry Number: 14094-09-8
- Chemical structure:
View 3d structure (requires JavaScript / HTML 5) - Species with the same structure:

Gas phase ion energetics data

Data compiled by: Sharon G. Lias, Rhoda D. Levin, and Sherif A. Kafafi
Ionization energy determinations
IE (eV) | Method | Reference |
---|---|---|
8.71 ± 0.04 | EI | Potzinger, Stracke, et al., 1975 |
Appearance energy determinations
Ion | AE (eV) | Other Products | Method | Reference | Comment |
---|---|---|---|---|---|
CH4OS+ | 9.28 ± 0.03 | C3H6 | EI | Potzinger, Stracke, et al., 1975 |

References

Potzinger, Stracke, et al., 1975
Potzinger, P.; Stracke, H.-U.; Kupper, W.; Gollnick, K.,
Ionisierungs- und Auftrittspotentialmessungen an Dialkylsulfoxiden,
Z. Naturforsch. A:, 1975, 30, 340. [all data]