Propane, 1-(methylsulfinyl)-
- Formula: C4H10OS
- Molecular weight: 106.187
- IUPAC Standard InChIKey: WOBARLJSXVAEGX-UHFFFAOYSA-N
- CAS Registry Number: 14094-08-7
- Chemical structure:
View 3d structure (requires JavaScript / HTML 5) - Other names: Methyl propyl sulfoxide

Gas phase ion energetics data

Data compiled by: Sharon G. Lias and Joel F. Liebman
Appearance energy determinations
Ion | AE (eV) | Other Products | Method | Reference | Comment |
---|---|---|---|---|---|
CH4OS+ | 9.36 ± 0.05 | CH3CH=CH2 | EI | Turecek, Brabec, et al., 1988 |

Normal alkane RI, non-polar column, temperature ramp

Column type | Active phase | I | Reference | Comment |
---|---|---|---|---|
Capillary | SPB-1 | 818. | Rao, Nagender, et al., 2007 | 30. m/0.32 mm/0.25 μm, Helium, 40. C @ 2. min, 2. K/min; Tend: 220. C |

References

Turecek, Brabec, et al., 1988
Turecek, F.; Brabec, L.; Vondrak, T.; Hanus, V.; Hajicek, J.; Havlas, Z.,
Sulfenic acids in the gas phase. Prepration, ionization energies and heats of gormation of methane-, ethene-, ethyne- and benzenesulfenic acid,
Collect. Czech. Chem. Commun., 1988, 53, 2140. [all data]
Rao, Nagender, et al., 2007
Rao, P.P.; Nagender, A.; Rao, L.J.; Rao, D.G.,
Studies on the effects of microwave drying and cabinet tray drying on the chemical composition of volatile oils of garlic powders,
Eur. Food Res. Technol., 2007, 224, 6, 791-795, https://doi.org/10.1007/s00217-006-0364-3
. [all data]