2-Propenoic acid, ethyl ester
- Formula: C5H8O2
- Molecular weight: 100.1158
- IUPAC Standard InChIKey: JIGUQPWFLRLWPJ-UHFFFAOYSA-N
- CAS Registry Number: 140-88-5
- Chemical structure:
View 3d structure (requires JavaScript / HTML 5) - Other names: Acrylic acid ethyl ester; Ethyl acrylate; Ethyl propenoate; Ethyl 2-propenoate; CH2=CHCOOC2H5; Acrylate d'ethyle; Acrylic acid, ethyl ester (inhibited); Ethyl acrylate, inhibited; Ethylacrylaat; Ethylakrylat; Etil acrilato; Etilacrilatului; NCI-C50384; Acrylsaeureaethylester; Aethylacrylat; Akrylanem etylu; Carboset 511; Ethoxycarbonylethylene; Ethylester kyseliny akrylove; Rcra waste number U113; Ethyl ester of 2-propenoic acid; NSC 8263

Gas phase thermochemistry data

Data compiled as indicated in comments:
DRB - Donald R. Burgess, Jr.
ALS - Hussein Y. Afeefy, Joel F. Liebman, and Stephen E. Stein
Quantity | Value | Units | Method | Reference | Comment |
---|---|---|---|---|---|
ΔfH°gas | -331.4 | kJ/mol | N/A | Vilcu and Perisanu, 1980 | Value computed using ΔfHliquid° value of -370.6 kj/mol from Vilcu and Perisanu, 1980 and ΔvapH° value of 39.2 kj/mol from Vilcu, Perisanu, et al., 1975.; DRB |
ΔfH°gas | -354.2 | kJ/mol | Ccb | Vilcu, Perisanu, et al., 1975 | ALS |
ΔfH°gas | -327.8 | kJ/mol | N/A | Baroody and Carpenter, 1972 | Value computed using ΔfHliquid° value of -367.0 kj/mol from Baroody and Carpenter, 1972 and ΔvapH° value of 39.2 kj/mol from Vilcu, Perisanu, et al., 1975.; DRB |

Condensed phase thermochemistry data

Data compiled by: Hussein Y. Afeefy, Joel F. Liebman, and Stephen E. Stein
Quantity | Value | Units | Method | Reference | Comment |
---|---|---|---|---|---|
ΔfH°liquid | -370.6 | kJ/mol | Chyd | Vilcu and Perisanu, 1980 | |
ΔfH°liquid | -393.4 | kJ/mol | Ccb | Vilcu, Perisanu, et al., 1975 | |
ΔfH°liquid | -367. | kJ/mol | Ccb | Baroody and Carpenter, 1972 | |
Quantity | Value | Units | Method | Reference | Comment |
ΔcH°liquid | -2715.0 | kJ/mol | Ccb | Vilcu, Perisanu, et al., 1975 | Corresponding ΔfHºliquid = -395.8 kJ/mol (simple calculation by NIST; no Washburn corrections) |

Phase change data

Data compiled as indicated in comments:
BS - Robert L. Brown and Stephen E. Stein
TRC - Thermodynamics Research Center, NIST Boulder Laboratories, Chris Muzny director
ALS - Hussein Y. Afeefy, Joel F. Liebman, and Stephen E. Stein
DRB - Donald R. Burgess, Jr.
AC - William E. Acree, Jr., James S. Chickos
Quantity | Value | Units | Method | Reference | Comment |
---|---|---|---|---|---|
Tboil | 373.0 | K | N/A | Weast and Grasselli, 1989 | BS |
Tboil | 373. | K | N/A | American Tokyo Kasei, 1988 | BS |
Tboil | 372.5 | K | N/A | Anonymous, 1955 | Uncertainty assigned by TRC = 3. K; TRC |
Quantity | Value | Units | Method | Reference | Comment |
ΔvapH° | 39.2 | kJ/mol | V | Vilcu, Perisanu, et al., 1975 | ALS |
ΔvapH° | 39.2 | kJ/mol | N/A | Vilcu, Perisanu, et al., 1975 | DRB |
Enthalpy of vaporization
ΔvapH (kJ/mol) | Temperature (K) | Reference | Comment |
---|---|---|---|
41.4 | 258. | Stull, 1947 | Based on data from 243. to 372. K.; AC |
Antoine Equation Parameters
log10(P) = A − (B / (T + C))
P = vapor pressure (bar)
T = temperature (K)
View plot Requires a JavaScript / HTML 5 canvas capable browser.
Temperature (K) | A | B | C | Reference | Comment |
---|---|---|---|---|---|
243.7 to 372.7 | 4.27453 | 1366.06 | -52.678 | Stull, 1947 | Coefficents calculated by NIST from author's data. |

Reaction thermochemistry data

Data compiled by: Hussein Y. Afeefy, Joel F. Liebman, and Stephen E. Stein
Individual Reactions
By formula: H2 + C5H8O2 = C5H10O2
Quantity | Value | Units | Method | Reference | Comment |
---|---|---|---|---|---|
ΔrH° | -136. ± 4.6 | kJ/mol | Chyd | Vilcu and Perisanu, 1980 | liquid phase |

Gas phase ion energetics data

Data compiled by: Sharon G. Lias, John E. Bartmess, Joel F. Liebman, John L. Holmes, Rhoda D. Levin, and W. Gary Mallard
Ionization energy determinations
IE (eV) | Method | Reference |
---|---|---|
≤10.3 | PE | Morizur, Mercier, et al., 1982 |

Kovats' RI, polar column, isothermal

Data compiled by: NIST Mass Spectrometry Data Center, William E. Wallace, director

Column type CapillaryCapillaryCapillary
Active phase SP-1000SP-1000SP-1000
Column length (m) 46.46.46.
Carrier gas N2N2N2
Substrate
Column diameter (mm) 0.230.230.23
Phase thickness (μm)
Temperature (C) 100.120.80.
I 992.993.989.
ReferenceHorna, Táborský, et al., 1985Horna, Táborský, et al., 1985, 2Horna, Táborský, et al., 1985, 2
Comment MSDC-RI MSDC-RI MSDC-RI

Normal alkane RI, non-polar column, temperature ramp

Data compiled by: NIST Mass Spectrometry Data Center, William E. Wallace, director

Column type CapillaryCapillary
Active phase DB-5OV-101
Column length (m) 13.525.
Carrier gas HeN2/He
Substrate
Column diameter (mm) 0.320.20
Phase thickness (μm)  0.10
Tstart (C) 35.50.
Tend (C) 225.250.
Heat rate (K/min) 6.6.
Initial hold (min) 3.
Final hold (min)
I 702.681.
Referencede Souza, Vásquez, et al., 2006Zenkevich, 2005
Comment MSDC-RI MSDC-RI

Van Den Dool and Kratz RI, non-polar column, temperature ramp

Data compiled by: NIST Mass Spectrometry Data Center, William E. Wallace, director

Column type Capillary
Active phase DB-1
Column length (m) 50.
Carrier gas He
Substrate
Column diameter (mm) 0.32
Phase thickness (μm) 1.05
Tstart (C) 40.
Tend (C) 260.
Heat rate (K/min) 2.
Initial hold (min)
Final hold (min) 40.
I 678.
ReferenceWu, Kuo, et al., 1991
Comment MSDC-RI

References

Vilcu and Perisanu, 1980
Vilcu, R.; Perisanu, S.,
The ideal gas state enthalpies of formation of some monomers,
Rev. Roum. Chim., 1980, 25, 619-624. [all data]
Vilcu, Perisanu, et al., 1975
Vilcu, R.; Perisanu, S.; Ciocazanu, I.,
Heats of formation in the ideal gas state of some substances containing carbon, hydrogen and oxygen,
Conf. Int. Thermodyn. Chim. C.R. 4th, 1975, 1, 105-112. [all data]
Baroody and Carpenter, 1972
Baroody, E.E.; Carpenter, G.A.,
Heats of formation of propellant compounds (U), Rpt. Naval Ordnance Systems Command Task No. 331-003/067-1/UR2402-001 for Naval Ordance Station, Indian Head, MD, 1972, 1-9. [all data]
Weast and Grasselli, 1989
CRC Handbook of Data on Organic Compounds, 2nd Editon, Weast,R.C and Grasselli, J.G., ed(s)., CRC Press, Inc., Boca Raton, FL, 1989, 1. [all data]
American Tokyo Kasei, 1988
American Tokyo Kasei,
TCI American Organic Chemical 88/89 Catalog, American Tokyo Kasei, Portland, OR, 1988, 1610. [all data]
Anonymous, 1955
Anonymous, R.,
, Am. Pet. Inst. Res. Proj. 45, Tech. Rep. 14, No. 1, Ohio State Univ., 1955. [all data]
Stull, 1947
Stull, Daniel R.,
Vapor Pressure of Pure Substances. Organic and Inorganic Compounds,
Ind. Eng. Chem., 1947, 39, 4, 517-540, https://doi.org/10.1021/ie50448a022
. [all data]
Morizur, Mercier, et al., 1982
Morizur, J.-P.; Mercier, J.; Sarraf, M.,
2-Substituted-2,3-dihydro-4H-pyrans: Competition between 'Retro Diels-Alder' fragmentation and substituent loss,
Org. Mass Spectrom., 1982, 17, 327. [all data]