Titanium, methyl [1,2,3,4-)-1,2,3,4-tetramethyl-2,4-cyclopentadien-1-yl](6-1,2,3-trimethyl-5-methylene-1,3-cyclopentadiene)-
- Formula: C19H28Ti
- Molecular weight: 304.293
- CAS Registry Number: 140852-73-9

Gas phase ion energetics data

Data compiled by: Sharon G. Lias and Joel F. Liebman
Ionization energy determinations
IE (eV) | Method | Reference | Comment |
---|---|---|---|
6.65 | PE | Vondrak, Mach, et al., 1992 | Vertical value |

References

Vondrak, Mach, et al., 1992
Vondrak, T.; Mach, K.; Varga, V.; Terpstra, A.,
Frontier occupied orbitals in methyl-substituted fulvene and dimethylenecyclopentenyltitanium complexes by UV-photoelectron spectroscopy and EHT calculations,
J. Organomet. Chem., 1992, 425, 27. [all data]