Estragole
- Formula: C10H12O
- Molecular weight: 148.2017
- IUPAC Standard InChIKey: ZFMSMUAANRJZFM-UHFFFAOYSA-N
- CAS Registry Number: 140-67-0
- Chemical structure:
View 3d structure (requires JavaScript / HTML 5) - Other names: Tarragon; Anisole, p-allyl-; Chavicol, O-methyl-; p-Allylanisole; p-Methoxyallylbenzene; Chavicol methyl ether; Esdragol; Esdragole; Esdragon; Estragol; Isoanethole; Methyl chavicol; 1-Allyl-4-methoxybenzene; 3-(p-Methoxyphenyl)propene; 4-Allylanisole; 4-Allylmethoxybenzene; 4-Methoxyallylbenzene; 4-Allyl-1-methoxybenzene; p-Allylmethoxybenzene; 1-Methoxy-4-(2-propenyl)benzene; NCI-C60946; Chavicol, methyl-; Ether, p-allylphenyl methyl; p-Allylphenyl methyl ether; Chavicyl methyl ether; 1-methoxy-4-prop-2-enylbenzene; Benzene, 1-methoxy-4-(2-propenyl)-; Benzene, 1-methoxy, 4-prop-2-enyl; Methyl chavicole; para-Allylanisole; Benzene, 1-methoxy-4-(2-propen-1-yl)-; NSC 404113; Estragol (Methylchavicol); methyl chavicole (estragole); para-Allylanisole (estragole)

Phase change data

Data compiled as indicated in comments:
BS - Robert L. Brown and Stephen E. Stein
TRC - Thermodynamics Research Center, NIST Boulder Laboratories, Chris Muzny director
AC - William E. Acree, Jr., James S. Chickos
Quantity | Value | Units | Method | Reference | Comment |
---|---|---|---|---|---|
Tboil | 488.7 | K | N/A | Weast and Grasselli, 1989 | BS |
Tboil | 493. | K | N/A | American Tokyo Kasei, 1988 | BS |
Tboil | 488.65 | K | N/A | Tiffeneau, 1904 | Uncertainty assigned by TRC = 3. K; TRC |
Enthalpy of vaporization
ΔvapH (kJ/mol) | Temperature (K) | Method | Reference | Comment |
---|---|---|---|---|
56.3 | 340. | A | Stephenson and Malanowski, 1987 | Based on data from 325. to 488. K.; AC |
Antoine Equation Parameters
log10(P) = A − (B / (T + C))
P = vapor pressure (bar)
T = temperature (K)
View plot Requires a JavaScript / HTML 5 canvas capable browser.
Temperature (K) | A | B | C | Reference | Comment |
---|---|---|---|---|---|
325.8 to 488. | 5.03793 | 2246.739 | -41.799 | Stull, 1947 | Coefficents calculated by NIST from author's data. |

Gas phase ion energetics data

Data compiled by: Sharon G. Lias, Rhoda D. Levin, and Sherif A. Kafafi
Ionization energy determinations
IE (eV) | Method | Reference | Comment |
---|---|---|---|
8.20 | PE | Eaton and Traylor, 1974 | Vertical value |

Normal alkane RI, polar column, temperature ramp

Data compiled by: NIST Mass Spectrometry Data Center, William E. Wallace, director

Column type CapillaryCapillaryCapillaryCapillaryCapillary
Active phase DB-WaxHP-FFAPTC-FFAPCarbowaxDB-FFAP
Column length (m) 30.30. 60.30.
Carrier gas HeliumHeliumHeHeHe
Substrate
Column diameter (mm) 0.250.250.250.250.32
Phase thickness (μm) 0.250.250.250.250.25
Tstart (C) 80.40.60.40.40.
Tend (C) 240.120.220.180.230.
Heat rate (K/min) 3.3.3.5.6.
Initial hold (min)  3.  1.
Final hold (min) 2.5.30.
I 1685.1691.1683.1676.1671.
ReferenceVahirua-Lechat, Mitermite, et al., 2010Guzman-Geronimo, Lopez, et al., 2008Kurose, Okamura, et al., 2007Singh, Kumar, et al., 2007Zeller and Rychlik, 2007
Comment MSDC-RI MSDC-RI MSDC-RI MSDC-RI MSDC-RI
Column type CapillaryCapillaryCapillaryCapillaryCapillary
Active phase DB-WaxPEG-20MHP-FFAPBP-20PEG-20M
Column length (m) 30.30.30.25.50.
Carrier gas He HeN2He
Substrate
Column diameter (mm) 0.250.250.250.250.2
Phase thickness (μm) 0.25 0.250.25
Tstart (C) 50.60.40.60.70.
Tend (C) 180.180.120.220.220.
Heat rate (K/min) 3.3.5.5.2.
Initial hold (min)  10.5.
Final hold (min) 40.30.3.
I 1661.1680.1691.1688.1660.
ReferenceLee, Umano, et al., 2005Yao, Guo, et al., 2005López, Guzmán, et al., 2004Mallavarapu, Kulkarni, et al., 2004Orav and Kann, 2001
Comment MSDC-RI MSDC-RI MSDC-RI MSDC-RI MSDC-RI
Column type CapillaryCapillaryCapillaryCapillaryCapillary
Active phase CW 20MCW 20MCW 20MCW 20MCW 20M
Column length (m) 25.25.25.25.25.
Carrier gas HydrogenHydrogenHydrogenHydrogenHydrogen
Substrate
Column diameter (mm) 0.320.320.320.320.32
Phase thickness (μm) 0.250.250.250.250.25
Tstart (C) 50.50.50.50.50.
Tend (C) 220.220.220.220.220.
Heat rate (K/min) 3.3.3.3.3.
Initial hold (min) 1.1.1.1.1.
Final hold (min) 10.10.10.10.10.
I 1656.1656.1656.1656.1657.
ReferenceBicchi, Binello, et al., 1999Bicchi, Binello, et al., 1999Bicchi, Binello, et al., 1999Bicchi, Binello, et al., 1999Bicchi, Binello, et al., 1999
Comment MSDC-RI MSDC-RI MSDC-RI MSDC-RI MSDC-RI
Column type CapillaryCapillaryCapillaryCapillary
Active phase TC-WaxDB-WaxSupelcowax-10DB-Wax
Column length (m) 60.30.90.30.
Carrier gas  HydrogenHe
Substrate
Column diameter (mm) 0.250.320.250.32
Phase thickness (μm)  0.500.25
Tstart (C) 80.30.35.70.
Tend (C) 240.190.220.200.
Heat rate (K/min) 3.3.2.4.
Initial hold (min) 5.6.20.2.
Final hold (min)   30.
I 1678.1682.1670.1674.
ReferenceShuichi, Masazumi, et al., 1996Young, Gilbert, et al., 1996Girard and Lau, 1995Wyllie, Brophy, et al., 1990
Comment MSDC-RI MSDC-RI MSDC-RI MSDC-RI

Van Den Dool and Kratz RI, non-polar column, custom temperature program

Data compiled by: NIST Mass Spectrometry Data Center, William E. Wallace, director

Column type CapillaryCapillaryCapillaryCapillaryCapillary
Active phase SE-52HP-5MSSE-525 % Phenyl methyl siloxaneSE-52
Column length (m) 30.30.30.30.30.
Carrier gas HeHeHeHeHe
Substrate
Column diameter (mm) 0.320.250.320.320.52
Phase thickness (μm) 0.150.250.150.150.15
Program 45C => 1C/min => 100C => 5C/min => 250C(10min)50C(4min) => 10C/min => 200C(0.5min) => 20C/min => 260C(5min)45C => 1C/min => 100C => 5C/min => 250C (10min)45C => 1C/min => 100C => 5C/min => 250C (10min)45C => 1C/min => 100C => 5C/min => 250C (10min)
I 1198.1188.1198.1196.1196.
ReferenceBruni, Bianchi, et al., 2007Pérez, Navarro, et al., 2007Guerrini, Sacchetti, et al., 2006Sacchetti, Maietti, et al., 2005Sacchetti, Medici, et al., 2004
Comment MSDC-RI MSDC-RI MSDC-RI MSDC-RI MSDC-RI

Kovats' RI, polar column, temperature ramp

Data compiled by: NIST Mass Spectrometry Data Center, William E. Wallace, director

Column type CapillaryCapillaryCapillary
Active phase Carbowax 20MSupelcowax-10Carbowax 20M
Column length (m) 25.60.50.
Carrier gas N2HeHe
Substrate
Column diameter (mm) 0.50.250.3
Phase thickness (μm)
Tstart (C) 60.35.70.
Tend (C) 200.200.210.
Heat rate (K/min) 5.3.2.
Initial hold (min)  5.
Final hold (min)  20.
I 1676.1685.1661.
ReferenceMallavarapu, Rao, et al., 1998Wong and Teng, 1994Randriamiharisoa and Gaydou, 1987
Comment MSDC-RI MSDC-RI MSDC-RI

Kovats' RI, polar column, isothermal

Data compiled by: NIST Mass Spectrometry Data Center, William E. Wallace, director

Column type Capillary
Active phase Carbowax 20M
Column length (m)
Carrier gas
Substrate
Column diameter (mm)
Phase thickness (μm) 0.45
Temperature (C) 150.
I 1701.
ReferenceTudor, Moldovan, et al., 1999
Comment MSDC-RI

References

Weast and Grasselli, 1989
CRC Handbook of Data on Organic Compounds, 2nd Editon, Weast,R.C and Grasselli, J.G., ed(s)., CRC Press, Inc., Boca Raton, FL, 1989, 1. [all data]
American Tokyo Kasei, 1988
American Tokyo Kasei,
TCI American Organic Chemical 88/89 Catalog, American Tokyo Kasei, Portland, OR, 1988, 1610. [all data]
Tiffeneau, 1904
Tiffeneau, M.,
Synthesis of Estragol and of ITs Unsaturated Aromatic Derivatives,
C. R. Hebd. Seances Acad. Sci., 1904, 139, 481. [all data]
Stephenson and Malanowski, 1987
Stephenson, Richard M.; Malanowski, Stanislaw,
Handbook of the Thermodynamics of Organic Compounds, 1987, https://doi.org/10.1007/978-94-009-3173-2
. [all data]
Stull, 1947
Stull, Daniel R.,
Vapor Pressure of Pure Substances. Organic and Inorganic Compounds,
Ind. Eng. Chem., 1947, 39, 4, 517-540, https://doi.org/10.1021/ie50448a022
. [all data]
Eaton and Traylor, 1974
Eaton, D.F.; Traylor, T.G.,
Distortional stabilization in phenyl participations,
J. Am. Chem. Soc., 1974, 96, 7109. [all data]