N,N,4-Trimethyl benzamide
- Formula: C10H13NO
- Molecular weight: 163.2163
- CAS Registry Number: 14062-78-3

Phase change data

Data compiled by: Hussein Y. Afeefy, Joel F. Liebman, and Stephen E. Stein
Quantity | Value | Units | Method | Reference | Comment |
---|---|---|---|---|---|
ΔsubH° | 82.4 ± 6.3 | kJ/mol | E | Guthrie, Pike, et al., 1992 | Hydrolysis |

Reaction thermochemistry data

Data compiled by: John E. Bartmess
Individual Reactions
C10H12NO- + = C10H13NO
By formula: C10H12NO- + H+ = C10H13NO
Quantity | Value | Units | Method | Reference | Comment |
---|---|---|---|---|---|
ΔrH° | 1529. ± 8.8 | kJ/mol | G+TS | Taft and Topsom, 1987 | gas phase; value altered from reference due to change in acidity scale |
Quantity | Value | Units | Method | Reference | Comment |
ΔrG° | 1501. ± 8.4 | kJ/mol | IMRE | Taft and Topsom, 1987 | gas phase; value altered from reference due to change in acidity scale |

Gas phase ion energetics data

Data evaluated as indicated in comments:
HL - Edward P. Hunter and Sharon G. Lias
Data compiled as indicated in comments:
B - John E. Bartmess
LBLHLM - Sharon G. Lias, John E. Bartmess, Joel F. Liebman, John L. Holmes, Rhoda D. Levin, and W. Gary Mallard
Quantity | Value | Units | Method | Reference | Comment |
---|---|---|---|---|---|
Proton affinity (review) | 927.0 | kJ/mol | N/A | Hunter and Lias, 1998 | HL |
Quantity | Value | Units | Method | Reference | Comment |
Gas basicity | 896.0 | kJ/mol | N/A | Hunter and Lias, 1998 | HL |
Ionization energy determinations
IE (eV) | Method | Reference | Comment |
---|---|---|---|
8.90 | PE | Gal, Geribaldi, et al., 1985 | Vertical value; LBLHLM |
De-protonation reactions
C10H12NO- + = C10H13NO
By formula: C10H12NO- + H+ = C10H13NO
Quantity | Value | Units | Method | Reference | Comment |
---|---|---|---|---|---|
ΔrH° | 1529. ± 8.8 | kJ/mol | G+TS | Taft and Topsom, 1987 | gas phase; value altered from reference due to change in acidity scale; B |
Quantity | Value | Units | Method | Reference | Comment |
ΔrG° | 1501. ± 8.4 | kJ/mol | IMRE | Taft and Topsom, 1987 | gas phase; value altered from reference due to change in acidity scale; B |

Gas phase thermochemistry data

Data compiled by: Hussein Y. Afeefy, Joel F. Liebman, and Stephen E. Stein
Quantity | Value | Units | Method | Reference | Comment |
---|---|---|---|---|---|
ΔfH°gas | -113. ± 10. | kJ/mol | Cm | Guthrie, Pike, et al., 1992 | Hydrolysis |

Condensed phase thermochemistry data

Data compiled by: Hussein Y. Afeefy, Joel F. Liebman, and Stephen E. Stein
Quantity | Value | Units | Method | Reference | Comment |
---|---|---|---|---|---|
ΔfH°solid | -195.1 ± 8.3 | kJ/mol | Cm | Guthrie, Pike, et al., 1992 | Hydrolysis |

References

Guthrie, Pike, et al., 1992
Guthrie, J.P.; Pike, D.C.; Lee, Y.-C.,
Equilibrium constants and heats of formation of methyl esters and N,N-dimethyl amides of substituted benzoic acids,
Can. J. Chem., 1992, 70, 1671-1683. [all data]
Taft and Topsom, 1987
Taft, R.W.; Topsom, R.D.,
The Nature and Analysis of Substituent Effects,
Prog. Phys. Org. Chem., 1987, 16, 1. [all data]
Hunter and Lias, 1998
Hunter, E.P.; Lias, S.G.,
Evaluated Gas Phase Basicities and Proton Affinities of Molecules: An Update,
J. Phys. Chem. Ref. Data, 1998, 27, 3, 413-656, https://doi.org/10.1063/1.556018
. [all data]
Gal, Geribaldi, et al., 1985
Gal, J.-F.; Geribaldi, S.; Pfister-Guillouzo, G.; Morris, D.G.,
Basicity of the carbonyl group. Part 12. Correlations between ionization potentials and lewis basicities in aromatic carbonyl compounds,
J. Chem. Soc. Perkin Trans. 2, 1985, 103. [all data]