Tungsten, tetrabromo-
- Formula: Br4W
- Molecular weight: 503.46
- IUPAC Standard InChIKey: YXPHMGGSLJFAPL-UHFFFAOYSA-J
- CAS Registry Number: 14055-81-3
- Chemical structure:
View 3d structure (requires JavaScript / HTML 5) - Permanent link for this species. Use this link for bookmarking this species for future reference.

Gas phase ion energetics data

Data compiled by: Sharon G. Lias, Rhoda D. Levin, and Sherif A. Kafafi
Ionization energy determinations
IE (eV) | Method | Reference |
---|---|---|
8.2 ± 0.2 | EI | Kaposi, Popovic, et al., 1977 |
Appearance energy determinations
Ion | AE (eV) | Other Products | Method | Reference | Comment |
---|---|---|---|---|---|
BrW+ | 19.4 ± 0.3 | 3Br | EI | Kaposi, Popovic, et al., 1977 | |
Br2W+ | 15.1 ± 0.3 | 2Br | EI | Kaposi, Popovic, et al., 1977 | |
Br3W+ | 11.2 ± 0.2 | Br | EI | Kaposi, Popovic, et al., 1977 | |
W+ | 23.1 ± 0.3 | Br | EI | Kaposi, Popovic, et al., 1977 |

References

Kaposi, Popovic, et al., 1977
Kaposi, O.; Popovic, A.; Marsel, J.,
Mass spectrometric studies of tungsten bromides and oxybromides,
J. Inorg. Nucl. Chem., 1977, 39, 1809. [all data]