Silane, bromotrifluoro-
- Formula: BrF3Si
- Molecular weight: 164.985
- IUPAC Standard InChIKey: AQWNPYLONRVQCU-UHFFFAOYSA-N
- CAS Registry Number: 14049-39-9
- Chemical structure:
View 3d structure (requires JavaScript / HTML 5) - Permanent link for this species. Use this link for bookmarking this species for future reference.

Gas phase ion energetics data

Data compiled by: Sharon G. Lias, Rhoda D. Levin, and Sherif A. Kafafi
Ionization energy determinations
IE (eV) | Method | Reference | Comment |
---|---|---|---|
12.46 ± 0.02 | PE | Cradock, Ebsworth, et al., 1973 | Vertical value |

References

Cradock, Ebsworth, et al., 1973
Cradock, S.; Ebsworth, E.A.V.; Whiteford, R.A.,
Photoelectron spectra of some simple fluorosilanes,
J. Chem. Soc. Dalton Trans., 1973, 22, 2401. [all data]