Silanethiol
- Formula: H4SSi
- Molecular weight: 64.182
- IUPAC Standard InChIKey: TXDNPSYEJHXKMK-UHFFFAOYSA-N
- CAS Registry Number: 14044-97-4
- Chemical structure:
View 3d structure (requires JavaScript / HTML 5) - Permanent link for this species. Use this link for bookmarking this species for future reference.

Gas phase ion energetics data

Data compiled by: Sharon G. Lias, Rhoda D. Levin, and Sherif A. Kafafi
Ionization energy determinations
IE (eV) | Method | Reference | Comment |
---|---|---|---|
9.97 | PE | Cradock and Whiteford, 1972 | Vertical value |

References

Cradock and Whiteford, 1972
Cradock, S.; Whiteford, R.A.,
Photoelectron spectra of the methyl, silyl and germyl derivatives of the group VI elements,
J. Chem. Soc. Faraday Trans. 2, 1972, 68, 281. [all data]