Difluorooxosilane
- Formula: F2OSi
- Molecular weight: 82.0817
- IUPAC Standard InChIKey: KSMSUXMVDODGKV-UHFFFAOYSA-N
- CAS Registry Number: 14041-22-6
- Chemical structure:
View 3d structure (requires JavaScript / HTML 5) - Permanent link for this species. Use this link for bookmarking this species for future reference.

Gas phase thermochemistry data

Quantity | Value | Units | Method | Reference | Comment |
---|---|---|---|---|---|
ΔfH°gas | -966.50 | kJ/mol | Review | Chase, 1998 | Data last reviewed in September, 1963 |
Quantity | Value | Units | Method | Reference | Comment |
S°gas,1 bar | 271.24 | J/mol*K | Review | Chase, 1998 | Data last reviewed in September, 1963 |
Gas Phase Heat Capacity (Shomate Equation)
Cp° = A + B*t + C*t2 + D*t3 +
E/t2
H° − H°298.15= A*t + B*t2/2 +
C*t3/3 + D*t4/4 − E/t + F − H
S° = A*ln(t) + B*t + C*t2/2 + D*t3/3 −
E/(2*t2) + G
Cp = heat capacity (J/mol*K)
H° = standard enthalpy (kJ/mol)
S° = standard entropy (J/mol*K)
t = temperature (K) / 1000.
View plot Requires a JavaScript / HTML 5 canvas capable browser.
Temperature (K) | 298. to 1100. | 1100. to 6000. |
---|---|---|
A | 32.40525 | 82.26748 |
B | 112.8157 | 0.488829 |
C | -97.95372 | -0.098780 |
D | 30.69700 | 0.006834 |
E | -0.397988 | -5.118915 |
F | -981.7128 | -1005.076 |
G | 278.6649 | 349.9360 |
H | -966.5040 | -966.5040 |
Reference | Chase, 1998 | Chase, 1998 |
Comment | Data last reviewed in September, 1963 | Data last reviewed in September, 1963 |

Reaction thermochemistry data

Data compiled as indicated in comments:
B - John E. Bartmess
M - Michael M. Meot-Ner (Mautner) and Sharon G. Lias
Individual Reactions
By formula: F- + F2OSi = (F- • F2OSi)
Quantity | Value | Units | Method | Reference | Comment |
---|---|---|---|---|---|
ΔrH° | 516.31 | kJ/mol | Ther | Damrauer, Simon, et al., 1991 | gas phase; Between HCO2H, HCl; B |
ΔrH° | 427. ± 71. | kJ/mol | IMRB | Larson and McMahon, 1987 | gas phase; These relative affinities are ca. 10 kcal/mol weaker than threshold values (see Wenthold and Squires, 1995) for donors greater than ca. 27 kcal/mol in free energy. This discrepancy has not yet been resolved, though the stronger value appears preferable.; B,M |

Ion clustering data

Data compiled as indicated in comments:
B - John E. Bartmess
M - Michael M. Meot-Ner (Mautner) and Sharon G. Lias
Clustering reactions
By formula: F- + F2OSi = (F- • F2OSi)
Quantity | Value | Units | Method | Reference | Comment |
---|---|---|---|---|---|
ΔrH° | 516.31 | kJ/mol | Ther | Damrauer, Simon, et al., 1991 | gas phase; Between HCO2H, HCl; B |
ΔrH° | 427. ± 71. | kJ/mol | IMRB | Larson and McMahon, 1987 | gas phase; These relative affinities are ca. 10 kcal/mol weaker than threshold values (see Wenthold and Squires, 1995) for donors greater than ca. 27 kcal/mol in free energy. This discrepancy has not yet been resolved, though the stronger value appears preferable.; B,M |

Vibrational and/or electronic energy levels

Data compiled by: Marilyn E. Jacox
State: X
Vib. sym. |
No. | Approximate type of mode |
cm-1 | Med. | Method | References | |
---|---|---|---|---|---|---|---|
a1 | 1 | Si=O stretch | 1309 | vs | Ar | IR | Schnockel, 1980 |
2 | SiF s-stretch | 835 | m | Ar | IR | Schnockel, 1980 | |
3 | SiF2 deform. | 423 | w m | Ar | IR | Schnockel, 1980 | |
b1 | 4 | OPLA | 344 | s | Ar | IR | Schnockel, 1980 |
b2 | 5 | SiF a-stretch | 996 | s | Ar | IR | Schnockel, 1980 |
6 | SiF2 rock | 333 | m | Ar | IR | Schnockel, 1980 | |
Additional references: Jacox, 1994, page 211

References

Chase, 1998
Chase, M.W., Jr.,
NIST-JANAF Themochemical Tables, Fourth Edition,
J. Phys. Chem. Ref. Data, Monograph 9, 1998, 1-1951. [all data]
Damrauer, Simon, et al., 1991
Damrauer, R.; Simon, R.; Krempp, M.,
Effect of Substituents on the Gas-Phase Acidity of Silanols,
J. Am. Chem. Soc., 1991, 113, 12, 4431, https://doi.org/10.1021/ja00012a009
. [all data]
Larson and McMahon, 1987
Larson, J.W.; McMahon, T.B.,
Trends in Gas Phase Fluoride Ion Affinities of the Main Group Oxyfluorides and Fluoride Sulfides. Fluoride Adducts of FAsO, FPO, FPO2, F2SiO, F4SO, FBO, F2SiS, FPS, FAsS, F2S2, and S2O.,
Inorg. Chem., 1987, 26, 24, 4018, https://doi.org/10.1021/ic00271a011
. [all data]
Wenthold and Squires, 1995
Wenthold, P.G.; Squires, R.R.,
Bond dissociation energies of F2(-) and HF2(-). A gas-phase experimental and G2 theoretical study,
J. Phys. Chem., 1995, 99, 7, 2002, https://doi.org/10.1021/j100007a034
. [all data]
Schnockel, 1980
Schnockel, H.,
Matrixreaktion von SiO mit F2. IR-spektroskopischer nachweis von molekularem OSiF2,
J. Mol. Struct., 1980, 65, 115, https://doi.org/10.1016/0022-2860(80)85184-2
. [all data]
Jacox, 1994
Jacox, M.E.,
Vibrational and electronic energy levels of polyatomic transient molecules, American Chemical Society, Washington, DC, 1994, 464. [all data]