Bis(2,2,6,6-tetramethyl-3,5-heptanedionato)copper(II)
- Formula: C22H38CuO4
- Molecular weight: 430.081
- IUPAC Standard InChIKey: VCIKJQZFNVXWPF-ATMONBRVSA-L
- CAS Registry Number: 14040-05-2
- Chemical structure:

Phase change data

Data compiled by: William E. Acree, Jr., James S. Chickos
Quantity | Value | Units | Method | Reference | Comment |
---|---|---|---|---|---|
ΔsubH° | 30.9 ± 0.2 | kcal/mol | N/A | Ribeiro da Silva, 1995 | |
ΔsubH° | 29.3 ± 1.6 | kcal/mol | C | Ribeiro Da Silva, Ribeiro Da Silva, et al., 1984 |
Enthalpy of vaporization
ΔvapH (kcal/mol) | Temperature (K) | Reference |
---|---|---|
18.6 ± 0.2 | 468. to 519. | Igumenov, Chumachenko, et al., 1979 |
Enthalpy of sublimation
ΔsubH (kcal/mol) | Temperature (K) | Method | Reference | Comment |
---|---|---|---|---|
30.50 ± 0.1 | 361. | TE | Colominas, Lau, et al., 2001 | |
30.40 ± 0.41 | 351. | TE | Colominas, Lau, et al., 2001 | |
28.7 | 433. to 463. | TGA | Fahlman and Barron, 2000 | |
23.9 | 404. | T | Rappoli and DeSisto, 1996 | Based on data from 392. to 415. K. |
17.9 | 400. to 430. | TGA,DTA | Yuan and Meng, 1996 | |
29.8 ± 0.2 | 372. | ME | Ribeiro da Silva, 1995 | |
29.78 | 407. | N/A | Tobaly and Lanchec, 1993 | Based on data from 362. to 452. K. |
29.54 | 445. | N/A | Waffenschmidt, Musolf, et al., 1992 | Based on data from 418. to 473. K. |

Gas phase ion energetics data

Data compiled by: Sharon G. Lias and Joel F. Liebman
Ionization energy determinations
IE (eV) | Method | Reference | Comment |
---|---|---|---|
7.4 | PE | Shcheka and Vovna, 1992 | Vertical value |

References

Ribeiro da Silva, 1995
Ribeiro da Silva, M.,
Vapour pressures and standard molar enthalpies of sublimation of seven crystalline copper(II) β-diketonates. The mean molar (Cu-O) bond-dissociation enthalpies,
The Journal of Chemical Thermodynamics, 1995, 27, 2, 175-190, https://doi.org/10.1006/jcht.1995.0014
. [all data]
Ribeiro Da Silva, Ribeiro Da Silva, et al., 1984
Ribeiro Da Silva, Manuel A.V.; Ribeiro Da Silva, Maria D.M.C.; Carvalho, Ana P.S.M.C.; Akello, Margaret J.; Pilcher, Geofrey,
Standard enthalpies of formation of bis(pentane-2,4-dionato)Cu(II) and of four bis(methyl-substituted heptane-3,5-dionato)Cu(II) complexes: the mean (Cu«58872»O) bond-dissociation enthalpies,
The Journal of Chemical Thermodynamics, 1984, 16, 2, 137-144, https://doi.org/10.1016/0021-9614(84)90146-0
. [all data]
Igumenov, Chumachenko, et al., 1979
Igumenov, I.K.; Chumachenko, Y.V.; Zemskov, S.V.,
Khim. Termodin. Termokhim., 1979, 65. [all data]
Colominas, Lau, et al., 2001
Colominas, Carles; Lau, Kai H.; Hildenbrand, Donald L.; Crouch-Baker, Steven; Sanjurjo, Angel,
Vapor Pressures of the Copper and Yttrium β-Diketonate MOCVD Precursors,
J. Chem. Eng. Data, 2001, 46, 2, 446-450, https://doi.org/10.1021/je0003445
. [all data]
Fahlman and Barron, 2000
Fahlman, Bradley D.; Barron, Andrew R.,
Substituent effects on the volatility of metal ?-diketonates,
Adv. Mater. Opt. Electron., 2000, 10, 3-5, 223-232, https://doi.org/10.1002/1099-0712(200005/10)10:3/5<223::AID-AMO411>3.0.CO;2-M
. [all data]
Rappoli and DeSisto, 1996
Rappoli, Brian J.; DeSisto, William J.,
Gas phase ultraviolet spectroscopy of high-temperature superconductor precursors for chemical vapor deposition processing,
Appl. Phys. Lett., 1996, 68, 19, 2726, https://doi.org/10.1063/1.115578
. [all data]
Yuan and Meng, 1996
Yuan, Z.; Meng, G.,
Synthesis, identification and properties of Cu(DPM)2 chelate,
Huaxue Shiji, 1996, 18, 2, 76. [all data]
Tobaly and Lanchec, 1993
Tobaly, P.; Lanchec, G.,
Vapour pressure and enthalpy of sublimation of a series of organometallic complexes: Cu(DPM)2, Y(DPM)3, Ba(DPM)2, and some derivatives,
The Journal of Chemical Thermodynamics, 1993, 25, 4, 503-510, https://doi.org/10.1006/jcht.1993.1158
. [all data]
Waffenschmidt, Musolf, et al., 1992
Waffenschmidt, E.; Musolf, J.; Heuken, M.; Heime, K.,
Vapor pressures of Y, Ba, Cu precursors for the growth of YBa2Cu3O7 by MOVPE,
J Supercond, 1992, 5, 2, 119-125, https://doi.org/10.1007/BF00618055
. [all data]
Shcheka and Vovna, 1992
Shcheka, O.L.; Vovna, V.I.,
Electronic structure of some copper(II) and iron(III) -diketonates,
J. Electron Spectrosc. Relat. Phenom., 1992, 60, 211. [all data]