Acetic acid, 4-methylphenyl ester
- Formula: C9H10O2
- Molecular weight: 150.1745
- IUPAC Standard InChIKey: CDJJKTLOZJAGIZ-UHFFFAOYSA-N
- CAS Registry Number: 140-39-6
- Chemical structure:
View 3d structure (requires JavaScript / HTML 5) - Other names: Acetic acid, p-tolyl ester; p-Acetoxytoluene; p-Cresol acetate; p-Cresyl acetate; p-Methylphenyl acetate; p-Tolyl acetate; p-Tolyl ethanoate; Narceol; 4-Acetoxytoluene; 4-Methylphenyl acetate; Cresyl acetate; 4-Tolyl acetate; Paracresyl acetate; p-Cresylic acetate; NSC 43244

Phase change data

Data compiled as indicated in comments:
BS - Robert L. Brown and Stephen E. Stein
AC - William E. Acree, Jr., James S. Chickos
Quantity | Value | Units | Method | Reference | Comment |
---|---|---|---|---|---|
Tboil | 483.7 | K | N/A | Aldrich Chemical Company Inc., 1990 | BS |
Tboil | 485.7 | K | N/A | Weast and Grasselli, 1989 | BS |
Enthalpy of vaporization
ΔvapH (kJ/mol) | Temperature (K) | Method | Reference | Comment |
---|---|---|---|---|
55.9 | 400. | A,EB | Stephenson and Malanowski, 1987 | Based on data from 385. to 480. K. See also Sheehan and Langer, 1969.; AC |

Gas phase ion energetics data

Data compiled by: Sharon G. Lias, Rhoda D. Levin, and Sherif A. Kafafi
Ionization energy determinations
IE (eV) | Method | Reference |
---|---|---|
7.84 ± 0.02 | EI | Benezra and Bursey, 1972 |
8.6 ± 0.2 | EI | Gamble, Gilbert, et al., 1971 |
Appearance energy determinations
Ion | AE (eV) | Other Products | Method | Reference | Comment |
---|---|---|---|---|---|
C2H3O+ | 14.0 ± 0.2 | ? | EI | Gamble, Gilbert, et al., 1971 | |
C7H7O+ | 13.47 ± 0.02 | CH3CO | EI | Benezra and Bursey, 1972 | |
C7H8O+ | 9.26 ± 0.02 | CH2=C=O | EI | Benezra and Bursey, 1972 | |
C7H8O+ | 9.8 ± 0.2 | CH2=C=O | EI | Gamble, Gilbert, et al., 1971 |

Normal alkane RI, non-polar column, temperature ramp

Data compiled by: NIST Mass Spectrometry Data Center, William E. Wallace, director

Column type CapillaryCapillary
Active phase HP-1OV-101
Column length (m) 50.50.
Carrier gas He
Substrate
Column diameter (mm) 0.20.22
Phase thickness (μm) 0.5
Tstart (C) 60.80.
Tend (C) 250.200.
Heat rate (K/min) 2.2.
Initial hold (min)
Final hold (min) 60.
I 1146.1150.
ReferenceBendimerad and Bendiab, 2005Egolf and Jurs, 1993
Comment MSDC-RI MSDC-RI

Normal alkane RI, polar column, custom temperature program

Data compiled by: NIST Mass Spectrometry Data Center, William E. Wallace, director

Column type Capillary
Active phase Carbowax 20M
Column length (m)
Carrier gas
Substrate
Column diameter (mm)
Phase thickness (μm)
Program not specified
I 1700.
ReferenceVinogradov, 2004
Comment MSDC-RI

References

Aldrich Chemical Company Inc., 1990
Aldrich Chemical Company Inc.,
Catalog Handbook of Fine Chemicals, Aldrich Chemical Company, Inc., Milwaukee WI, 1990, 1. [all data]
Weast and Grasselli, 1989
CRC Handbook of Data on Organic Compounds, 2nd Editon, Weast,R.C and Grasselli, J.G., ed(s)., CRC Press, Inc., Boca Raton, FL, 1989, 1. [all data]
Stephenson and Malanowski, 1987
Stephenson, Richard M.; Malanowski, Stanislaw,
Handbook of the Thermodynamics of Organic Compounds, 1987, https://doi.org/10.1007/978-94-009-3173-2
. [all data]
Sheehan and Langer, 1969
Sheehan, Richard J.; Langer, Stanley H.,
Vapor pressures of fluorine- and silicon-containing derivatives of some hydroxylic compounds,
J. Chem. Eng. Data, 1969, 14, 2, 248-250, https://doi.org/10.1021/je60041a011
. [all data]
Benezra and Bursey, 1972
Benezra, S.A.; Bursey, M.M.,
Hydrogen bonding in mass spectral activated complexes. A correction,
J. Chem. Soc. Perkin Trans. 2, 1972, 11, 1537. [all data]
Gamble, Gilbert, et al., 1971
Gamble, A.A.; Gilbert, J.R.; Tillett, J.G.,
Substituent effects on the mass spectra of substituted phenyl acetates,
Org. Mass Spectrom., 1971, 5, 1093. [all data]