HypoFluorous acid
- Formula: FHO
- Molecular weight: 36.0057
- IUPAC Standard InChIKey: AQYSYJUIMQTRMV-UHFFFAOYSA-N
- CAS Registry Number: 14034-79-8
- Chemical structure:
View 3d structure (requires JavaScript / HTML 5) - Permanent link for this species. Use this link for bookmarking this species for future reference.

Gas phase thermochemistry data

Quantity | Value | Units | Method | Reference | Comment |
---|---|---|---|---|---|
ΔfH°gas | -98.32 | kJ/mol | Review | Chase, 1998 | Data last reviewed in December, 1972 |
Quantity | Value | Units | Method | Reference | Comment |
S°gas,1 bar | 226.77 | J/mol*K | Review | Chase, 1998 | Data last reviewed in December, 1972 |
Gas Phase Heat Capacity (Shomate Equation)
Cp° = A + B*t + C*t2 + D*t3 +
E/t2
H° − H°298.15= A*t + B*t2/2 +
C*t3/3 + D*t4/4 − E/t + F − H
S° = A*ln(t) + B*t + C*t2/2 + D*t3/3 −
E/(2*t2) + G
Cp = heat capacity (J/mol*K)
H° = standard enthalpy (kJ/mol)
S° = standard entropy (J/mol*K)
t = temperature (K) / 1000.
View plot Requires a JavaScript / HTML 5 canvas capable browser.
Temperature (K) | 298. to 1300. | 1300. to 6000. |
---|---|---|
A | 24.78773 | 49.80592 |
B | 45.03365 | 4.151080 |
C | -30.03238 | -0.766860 |
D | 8.137128 | 0.049557 |
E | 0.013346 | -6.154957 |
F | -107.4229 | -125.8041 |
G | 244.6766 | 270.6278 |
H | -98.32400 | -98.32400 |
Reference | Chase, 1998 | Chase, 1998 |
Comment | Data last reviewed in December, 1972 | Data last reviewed in December, 1972 |

Reaction thermochemistry data

Data compiled by: John E. Bartmess
Individual Reactions
FO- + =
Quantity | Value | Units | Method | Reference | Comment |
---|---|---|---|---|---|
ΔrH° | 1517. ± 14. | kJ/mol | Acid | Gilles, Polak, et al., 1992 | gas phase |
Quantity | Value | Units | Method | Reference | Comment |
ΔrG° | 1490. ± 15. | kJ/mol | H-TS | Gilles, Polak, et al., 1992 | gas phase |

Gas phase ion energetics data

Data evaluated as indicated in comments:
L - Sharon G. Lias
Data compiled as indicated in comments:
B - John E. Bartmess
LLK - Sharon G. Lias, Rhoda D. Levin, and Sherif A. Kafafi
Quantity | Value | Units | Method | Reference | Comment |
---|---|---|---|---|---|
IE (evaluated) | 12.71 ± 0.01 | eV | N/A | N/A | L |
Ionization energy determinations
IE (eV) | Method | Reference | Comment |
---|---|---|---|
12.69 ± 0.03 | PE | Berkowitz, Dehmer, et al., 1973 | LLK |
12.71 ± 0.01 | PI | Berkowitz, Appelman, et al., 1973 | LLK |
Appearance energy determinations
Ion | AE (eV) | Other Products | Method | Reference | Comment |
---|---|---|---|---|---|
HO+ | 15.07 | F | PI | Berkowitz, Appelman, et al., 1973 | LLK |
O+ | 14.34 | HF | PI | Berkowitz, Appelman, et al., 1973 | LLK |
De-protonation reactions
FO- + =
Quantity | Value | Units | Method | Reference | Comment |
---|---|---|---|---|---|
ΔrH° | 1517. ± 14. | kJ/mol | Acid | Gilles, Polak, et al., 1992 | gas phase; B |
Quantity | Value | Units | Method | Reference | Comment |
ΔrG° | 1490. ± 15. | kJ/mol | H-TS | Gilles, Polak, et al., 1992 | gas phase; B |

Phase change data

Data compiled by: Thermodynamics Research Center, NIST Boulder Laboratories, Chris Muzny director
Quantity | Value | Units | Method | Reference | Comment |
---|---|---|---|---|---|
Tfus | 156. | K | N/A | Studier and Appleman, 1971 | Uncertainty assigned by TRC = 2. K |

Vibrational and/or electronic energy levels

Data compiled as indicated in comments:
J - Marilyn E. Jacox
Shim - Takehiko Shimanouchi
State: ?
Energy (cm-1) |
Med. | Transition | λmin (nm) |
λmax (nm) |
References | ||
---|---|---|---|---|---|---|---|
Td = 26300 | U | gas | Elliott, 1983 | ||||
Appelman, Downs, et al., 1989 | |||||||
State: X
Vib. sym. |
No. | Approximate type of mode |
cm-1 | Med. | Method | References | |
---|---|---|---|---|---|---|---|
a' | 1 | OH stretch | 3577.93 | gas | IR | Appelman and Kim, 1972 Burger, Pawelke, et al., 1989 | |
1 | OH stretch | 3572 | m s | Ar | IR | Appelman, Downs, et al., 1989 | |
1 | OH stretch | 3537.1 | s | N2 | IR | Goleb, Claassen, et al., 1972 Appelman, Downs, et al., 1989 | |
1 | OH stretch | 3550 | s | O2 | IR | Appelman, Downs, et al., 1989 | |
2 | Bend | 1353.40 | gas | IR | Appelman and Kim, 1972 Burger, Pawelke, et al., 1988 | ||
2 | Bend | 1350 | vs | Ar | IR | Appelman, Downs, et al., 1989 | |
2 | Bend | 1359.0 | vs | N2 | IR | Goleb, Claassen, et al., 1972 Appelman, Downs, et al., 1989 | |
2 | Bend | 1350 | vs | O2 | IR | Appelman, Downs, et al., 1989 | |
3 | OF stretch | 889.08 | gas | IR | Appelman and Kim, 1972 Burger, Pawelke, et al., 1988 | ||
3 | OF stretch | 888 | m s | Ar | IR | Appelman, Downs, et al., 1989 | |
3 | OF stretch | 886.0 | w m | N2 | IR | Noble and Pimentel, 1968 Goleb, Claassen, et al., 1972 Appelman, Downs, et al., 1989 | |
3 | OF stretch | 884 | m s | O2 | IR | Appelman, Downs, et al., 1989 | |
Additional references: Jacox, 1994, page 51; Kim, Pearson, et al., 1972; Pearson and Kim, 1972; Burger, Pawelke, et al., 1989, 2

References

Chase, 1998
Chase, M.W., Jr.,
NIST-JANAF Themochemical Tables, Fourth Edition,
J. Phys. Chem. Ref. Data, Monograph 9, 1998, 1-1951. [all data]
Gilles, Polak, et al., 1992
Gilles, M.K.; Polak, M.L.; Lineberger, W.C.,
Photoelectron Spectroscopy of the Halogen Oxide Anions FO-, ClO-, BrO-, IO-, OClO-, and OIO-,
J. Chem. Phys., 1992, 96, 11, 8012, https://doi.org/10.1063/1.462352
. [all data]
Berkowitz, Dehmer, et al., 1973
Berkowitz, J.; Dehmer, J.L.; Appelman, E.H.,
Photoelectron spectrum of hypofluorous acid, HOF,
Chem. Phys. Lett., 1973, 19, 334. [all data]
Berkowitz, Appelman, et al., 1973
Berkowitz, J.; Appelman, E.H.; Chupka, W.A.,
Photoionization of HOF with mass analysis,
J. Chem. Phys., 1973, 58, 1950. [all data]