Bis(acetylacetonato)zinc
- Formula: C10H14O4Zn
- Molecular weight: 263.60
- IUPAC Standard InChIKey: CYDXJXDAFPJUQE-FDGPNNRMSA-L
- CAS Registry Number: 14024-63-6
- Chemical structure:
View 3d structure (requires JavaScript / HTML 5) - Other names: Zinc, bis(2,4-pentanedionato)-; Zinc, bis(2,4-pentanedionato-O,O')-, (T-4)-; Bis(2,4-pentanedionato)zinc; Zinc acetoacetonate; Zinc acetylacetonate; Zinc acetylacetone chelate; Zinc bis(acetylacetonate); Zinc bis(acetylacetone); Zinc(II) acetylacetonate; Zinc, bis(2,4-pentanedionato)di-; (CH3COCHCOCH3)2Zn; Zinc 2,4-pentanedionate; Zinc bis(2,4-pentanedionate); Zinc, bis(2,4-pentanedionato-O,O')-; bis(pentane-2,4-dionato-O,O')zinc

Phase change data

Data compiled as indicated in comments:
TRC - Thermodynamics Research Center, NIST Boulder Laboratories, Chris Muzny director
AC - William E. Acree, Jr., James S. Chickos
DH - Eugene S. Domalski and Elizabeth D. Hearing
Quantity | Value | Units | Method | Reference | Comment |
---|---|---|---|---|---|
Tfus | 400.5 | K | N/A | Grinberg, Lazarev, et al., 1986 | Uncertainty assigned by TRC = 0.1 K; TRC |
Quantity | Value | Units | Method | Reference | Comment |
ΔsubH° | 133. ± 8. | kJ/mol | C | Murata, Sakiyama, et al., 1985 | See also Ribeiro da Silva, Pilcher, et al., 1988.; AC |
Enthalpy of fusion
ΔfusH (kJ/mol) | Temperature (K) | Reference | Comment |
---|---|---|---|
18.200 | 400.5 | Grinberg, Lazarev, et al., 1986 | DH |
Entropy of fusion
ΔfusS (J/mol*K) | Temperature (K) | Reference | Comment |
---|---|---|---|
45.5 | 400.5 | Grinberg, Lazarev, et al., 1986 | DH |

Gas phase ion energetics data

Data compiled as indicated in comments:
LBLHLM - Sharon G. Lias, John E. Bartmess, Joel F. Liebman, John L. Holmes, Rhoda D. Levin, and W. Gary Mallard
LLK - Sharon G. Lias, Rhoda D. Levin, and Sherif A. Kafafi
RDSH - Henry M. Rosenstock, Keith Draxl, Bruce W. Steiner, and John T. Herron
Ionization energy determinations
IE (eV) | Method | Reference | Comment |
---|---|---|---|
7.8 | PE | Kitagawa, Morishima, et al., 1983 | LBLHLM |
8.62 ± 0.05 | EI | Reichert and Westmore, 1969 | RDSH |
8.34 | PE | Kitagawa, Morishima, et al., 1983 | Vertical value; LBLHLM |
8.46 | PE | Brittain and Disch, 1975 | Vertical value; LLK |
Appearance energy determinations
Ion | AE (eV) | Other Products | Method | Reference | Comment |
---|---|---|---|---|---|
C5H7O2Zn+ | 14.1 ± 0.2 | ? | EI | Reichert and Westmore, 1969 | RDSH |
C9H11O4Zn+ | 10.9 ± 0.1 | ? | EI | Reichert and Westmore, 1969 | RDSH |

References

Grinberg, Lazarev, et al., 1986
Grinberg, Ya.Kh.; Lazarev, V.B.; Zavernyaev, A.Yu.; Shreider, V.A.; Chepik, S.D.,
Enthalpies of fusion of aluminium(III), chromium(III), zirconium(IV), and zinc(II) acetylacetonates,
Zhur. Fiz. Khim., 1986, 60, 1044. [all data]
Murata, Sakiyama, et al., 1985
Murata, S.; Sakiyama, M.; Seki, S.,
Sublimation calorimetric studies using a calvet microcalorimeter,
Thermochimica Acta, 1985, 88, 1, 121-126, https://doi.org/10.1016/0040-6031(85)85419-8
. [all data]
Ribeiro da Silva, Pilcher, et al., 1988
Ribeiro da Silva, Manuel A.V.; Pilcher, Geoffrey; Irving, Roger J.,
Standard enthalpies of formation of the bis(pentane-2,4-dionato) complexes of the Group II metals: Be, Mg, Ca, Sr, Ba, Zn, Cd, and Hg. The mean (metal-oxygen) bond-dissociation enthalpies,
The Journal of Chemical Thermodynamics, 1988, 20, 1, 95-102, https://doi.org/10.1016/0021-9614(88)90213-3
. [all data]
Kitagawa, Morishima, et al., 1983
Kitagawa, S.; Morishima, I.; Yoshikawa, K.,
UV photoelectron spectra of some transition metal(II)aAcetylacetonates,
Polyhedron, 1983, 2, 43. [all data]
Reichert and Westmore, 1969
Reichert, C.; Westmore, J.B.,
Mass spectral studies of metal chelates. IV.Mass spectra, appearance potentials, and coordinate bond energies of bis(acetylacetonate)metal(II) complexes of the first transition series,
Inorg. Chem., 1969, 8, 1012. [all data]
Brittain and Disch, 1975
Brittain, H.G.; Disch, R.L.,
The He(I) photoelectron spectra of some bivalent transition metal β-diketonate complexes*,
J. Electron Spectrosc. Relat. Phenom., 1975, 7, 475. [all data]