Hydroperoxide, 1-methylbutyl
- Formula: C5H12O2
- Molecular weight: 104.1476
- IUPAC Standard InChIKey: XRIRVAYMWUMXBR-UHFFFAOYSA-N
- CAS Registry Number: 14018-58-7
- Chemical structure:
View 3d structure (requires JavaScript / HTML 5) - Other names: 2-Hydroperoxypentane; n-C3H7CH(CH3)OOH

Gas phase ion energetics data

Data compiled as indicated in comments:
LLK - Sharon G. Lias, Rhoda D. Levin, and Sherif A. Kafafi
RDSH - Henry M. Rosenstock, Keith Draxl, Bruce W. Steiner, and John T. Herron
Ionization energy determinations
IE (eV) | Method | Reference | Comment |
---|---|---|---|
9.35 ± 0.03 | PE | Ashmore and Burgess, 1977 | LLK |
10.05 | PE | Ashmore and Burgess, 1977 | Vertical value; LLK |
Appearance energy determinations
Ion | AE (eV) | Other Products | Method | Reference | Comment |
---|---|---|---|---|---|
C5H11+ | 10.7 ± 0.1 | ? | EI | Burgess, SenSharma, et al., 1968 | RDSH |
C5H11O+ | 10.4 ± 0.1 | OH | EI | Burgess, SenSharma, et al., 1968 | RDSH |
C5H11O2+ | 10.1 ± 0.1 | H | EI | Burgess, SenSharma, et al., 1968 | RDSH |

Normal alkane RI, non-polar column, custom temperature program

Column type | Active phase | I | Reference | Comment |
---|---|---|---|---|
Capillary | HP-5 | 855. | Zhao, Li, et al., 2008 | 30. m/0.25 mm/0.25 μm; Program: 40 0C (2 min) 5 0C/min -> 80 0C 7 oC/min -> 160 0C 9 0C/min -> 200 0C 20 0C/min -> 280 0C (10 min) |

References

Ashmore and Burgess, 1977
Ashmore, F.S.; Burgess, A.R.,
Study of Some Medium Size Alcohols and Hydroperoxides by Photoelectron Spectroscopy,
J. Chem. Soc. Faraday Trans. 2, 1977, 73, 1247. [all data]
Burgess, SenSharma, et al., 1968
Burgess, A.R.; SenSharma, D.K.; White, M.J.D.,
The mass spectrometry of some alkyl peroxy radicals and related alkyl hydroperoxides,
Advan. Mass Spectrom., 1968, 4, 345. [all data]
Zhao, Li, et al., 2008
Zhao, Y.; Li, J.; Xu, Y.; Duan, H.; Fan, W.; Zhao, G.,
EXtraction, preparation and identification of volatile compounds in Changyu XO brandy,
Chinese J. Chromatogr., 2008, 26, 2, 212-222, https://doi.org/10.1016/S1872-2059(08)60014-0
. [all data]