trans-Cinnamic acid
- Formula: C9H8O2
- Molecular weight: 148.1586
- IUPAC Standard InChIKey: WBYWAXJHAXSJNI-VOTSOKGWSA-N
- CAS Registry Number: 140-10-3
- Chemical structure:
View 3d structure (requires JavaScript / HTML 5) - Stereoisomers:
- Other names: 2-Propenoic acid, 3-phenyl-, (E)-; Cinnamic acid, (E)-; (E)-Cinnamic acid; trans-β-Carboxystyrene; trans-3-Phenyl-2-propenoic acid; trans-3-Phenylacrylic Acid; (E)-3-Phenyl-2-propenoic acid; (2E)-3-Phenyl-2-propenoic acid; (E)-3-Phenylacrylic acid; 2-Propenoic acid, 3-phenyl-, (2E)-; NSC 44010; Cinnamic acid

Phase change data

Data compiled as indicated in comments:
BS - Robert L. Brown and Stephen E. Stein
AC - William E. Acree, Jr., James S. Chickos
DH - Eugene S. Domalski and Elizabeth D. Hearing
Quantity | Value | Units | Method | Reference | Comment |
---|---|---|---|---|---|
Tboil | 573.2 | K | N/A | Weast and Grasselli, 1989 | BS |
Quantity | Value | Units | Method | Reference | Comment |
ΔsubH° | 107.1 ± 0.8 | kJ/mol | ME | Monte and Hillesheim, 1999 | Based on data from 333. to 347. K.; AC |
Enthalpy of vaporization
ΔvapH (kJ/mol) | Temperature (K) | Method | Reference | Comment |
---|---|---|---|---|
73.9 | 445. | A | Stephenson and Malanowski, 1987 | Based on data from 430. to 573. K.; AC |
Antoine Equation Parameters
log10(P) = A − (B / (T + C))
P = vapor pressure (bar)
T = temperature (K)
View plot Requires a JavaScript / HTML 5 canvas capable browser.
Temperature (K) | A | B | C | Reference | Comment |
---|---|---|---|---|---|
400.7 to 573. | 6.14389 | 3321.821 | -32.118 | Stull, 1947 | Coefficents calculated by NIST from author's data. |
Enthalpy of fusion
ΔfusH (kJ/mol) | Temperature (K) | Method | Reference | Comment |
---|---|---|---|---|
22.626 | 406.15 | N/A | Singh and Kumar, 1986 | DH |
22.21 | 406.1 | N/A | Mota, Queimada, et al., 2008 | AC |
22.6 | 404.8 | DSC | Sharma, Jamwal, et al., 2004 | AC |
22.63 | 406.2 | N/A | Acree, 1991 | AC |

Gas phase ion energetics data

Data compiled by: Sharon G. Lias, John E. Bartmess, Joel F. Liebman, John L. Holmes, Rhoda D. Levin, and W. Gary Mallard
Ionization energy determinations
IE (eV) | Method | Reference |
---|---|---|
9.00 ± 0.05 | EI | Schaldach, 1984 |

Condensed phase thermochemistry data

Data compiled as indicated in comments:
ALS - Hussein Y. Afeefy, Joel F. Liebman, and Stephen E. Stein
DH - Eugene S. Domalski and Elizabeth D. Hearing
Quantity | Value | Units | Method | Reference | Comment |
---|---|---|---|---|---|
ΔfH°solid | -77.75 | kcal/mol | Ccb | Zavoianu, Ciocazan, et al., 1990 | ALS |
ΔfH°solid | -80.54 | kcal/mol | Ccb | Parks and Mosher, 1962 | ALS |
ΔfH°solid | -81.3 | kcal/mol | Ccb | Landrieu, Baylocq, et al., 1929 | ALS |
Quantity | Value | Units | Method | Reference | Comment |
ΔcH°solid | -1041.9 | kcal/mol | Ccb | Zavoianu, Ciocazan, et al., 1990 | Corresponding ΔfHºsolid = -77.8 kcal/mol (simple calculation by NIST; no Washburn corrections); ALS |
ΔcH°solid | -1039.2 ± 0.4 | kcal/mol | Ccb | Parks and Mosher, 1962 | Corresponding ΔfHºsolid = -80.53 kcal/mol (simple calculation by NIST; no Washburn corrections); ALS |
ΔcH°solid | -1038.4 | kcal/mol | Ccb | Landrieu, Baylocq, et al., 1929 | Corresponding ΔfHºsolid = -81.3 kcal/mol (simple calculation by NIST; no Washburn corrections); ALS |
Constant pressure heat capacity of solid
Cp,solid (cal/mol*K) | Temperature (K) | Reference | Comment |
---|---|---|---|
47.20 | 323. | Satoh and Sogabe, 1939 | T = 0 to 100°C. Mean value.; DH |

Kovats' RI, non-polar column, custom temperature program

Column type | Active phase | I | Reference | Comment |
---|---|---|---|---|
Capillary | DB-5MS | 1435. | Maia, Andrade, et al., 2000 | 30. m/0.25 mm/0.25 μm, He; Program: 40C => 2C/min => 60C => 4C/min => 260C |

Van Den Dool and Kratz RI, non-polar column, temperature ramp

Column type | Active phase | I | Reference | Comment |
---|---|---|---|---|
Capillary | DB-1 | 1462. | Osorio, Alarcon, et al., 2006 | 25. m/0.2 mm/0.33 μm, 4. K/min; Tstart: 50. C; Tend: 300. C |
Capillary | DB-1 | 1450. | Adedeji, Hartman, et al., 1991 | 60. m/0.25 mm/0.25 μm, He, 40. C @ 3. min, 2. K/min, 280. C @ 10. min |
Packed | SE-30 | 1428. | Peng, Ding, et al., 1988 | He, Supelcoport and Chromosorb, 40. C @ 4. min, 10. K/min, 250. C @ 60. min; Column length: 3.05 m |

Van Den Dool and Kratz RI, non-polar column, custom temperature program

Column type | Active phase | I | Reference | Comment |
---|---|---|---|---|
Capillary | VF-5MS | 1450.9 | Tret'yakov, 2008 | 30. m/0.25 mm/0.25 μm, He; Program: Multi-step temperature program; T(initial)=60C; T(final)=270C |

Van Den Dool and Kratz RI, polar column, temperature ramp

Column type | Active phase | I | Reference | Comment |
---|---|---|---|---|
Capillary | DB-Wax | 2835. | Osorio, Alarcon, et al., 2006 | 30. m/0.25 mm/0.25 μm, He, 50. C @ 4. min, 4. K/min, 220. C @ 20. min |
Capillary | DB-Wax | 2804. | Humpf and Schreier, 1991 | 30. m/0.25 mm/0.25 μm, He, 50. C @ 3. min, 4. K/min, 220. C @ 20. min |
Capillary | CP-Wax 58CB | 2822. | Pabst, Barron, et al., 1991 | 30. m/0.25 mm/0.22 μm, He, 3. K/min; Tstart: 40. C; Tend: 220. C |

Normal alkane RI, non-polar column, isothermal

Column type | Active phase | Temperature (C) | I | Reference | Comment |
---|---|---|---|---|---|
Packed | Apieson L | 140. | 1393. | Hedin, Minyard, et al., 1967 | Nitrogen, Chromosorb W HMDS (60-80 mesh); Column length: 1.8 m |

Normal alkane RI, non-polar column, temperature ramp

Column type | Active phase | I | Reference | Comment |
---|---|---|---|---|
Capillary | HP-5 MS | 1454. | Jerkovic, Tuberso, et al., 2010 | 30. m/0.25 mm/0.25 μm, Helium, 70. C @ 2. min, 3. K/min, 200. C @ 18. min |
Capillary | BPX-5 | 1430. | Fons, Rapior, et al., 2006 | 25. m/0.20 mm/0.13 μm, Helium, 50. C @ 2. min, 3. K/min; Tend: 230. C |
Capillary | HP-1 | 1394. | Ong and Acree, 1998 | 4. K/min; Column length: 25. m; Column diameter: 0.32 mm; Tstart: 35. C; Tend: 250. C |

Normal alkane RI, non-polar column, custom temperature program

Column type | Active phase | I | Reference | Comment |
---|---|---|---|---|
Capillary | HP-5 MS | 1457. | Fan, Lu, et al., 2009 | 30. m/0.25 mm/0.25 μm, Helium; Program: 40 0C (3 min) 3 0C/min -> 160 0C (2 min) 8 0C/min -> 220 0C (3 min) |
Capillary | HP-5MS | 1458. | Alissandrakis, Kibaris, et al., 2005 | 30. m/0.25 mm/0.25 μm, He; Program: 40C(3min) => 2C/min => 180C => 10C/min => 250C(5min) |

Normal alkane RI, polar column, temperature ramp

Column type | Active phase | I | Reference | Comment |
---|---|---|---|---|
Capillary | DB-Wax | 2842. | Osorio, Duque, et al., 2002 | 30. m/0.25 mm/0.25 μm, He, 50. C @ 4. min, 4. K/min, 220. C @ 20. min |
Capillary | DB-Wax | 2844. | Osorio, Duque, et al., 2002 | 30. m/0.25 mm/0.25 μm, He, 50. C @ 4. min, 4. K/min, 220. C @ 20. min |
Capillary | DB-Wax | 2827. | Parada and Duque, 1998 | 30. m/0.25 mm/0.25 μm, He, 50. C @ 3. min, 4. K/min, 240. C @ 10. min |
Capillary | DB-Wax | 2832. | Parada and Duque, 1998 | 30. m/0.25 mm/0.25 μm, He, 50. C @ 3. min, 4. K/min, 240. C @ 10. min |

References

Weast and Grasselli, 1989
CRC Handbook of Data on Organic Compounds, 2nd Editon, Weast,R.C and Grasselli, J.G., ed(s)., CRC Press, Inc., Boca Raton, FL, 1989, 1. [all data]
Monte and Hillesheim, 1999
Monte, Manuel J.S.; Hillesheim, Dorothea M.,
Vapour pressures, enthalpies and entropies of sublimation of trans -cinnamic acid and of nine methoxy and dimethoxycinnamic acids,
The Journal of Chemical Thermodynamics, 1999, 31, 11, 1443-1456, https://doi.org/10.1006/jcht.1999.0540
. [all data]
Stephenson and Malanowski, 1987
Stephenson, Richard M.; Malanowski, Stanislaw,
Handbook of the Thermodynamics of Organic Compounds, 1987, https://doi.org/10.1007/978-94-009-3173-2
. [all data]
Stull, 1947
Stull, Daniel R.,
Vapor Pressure of Pure Substances. Organic and Inorganic Compounds,
Ind. Eng. Chem., 1947, 39, 4, 517-540, https://doi.org/10.1021/ie50448a022
. [all data]
Singh and Kumar, 1986
Singh, N.B.; Kumar, P.,
Solidification behavior of the cinnamic acid-p-nitrophenol eutectic system,
J. Chem. Eng. Data, 1986, 31, 406-408. [all data]
Mota, Queimada, et al., 2008
Mota, Fatima L.; Queimada, Antonio J.; Pinho, Simao P.; Macedo, Eugenia A.,
Aqueous Solubility of Some Natural Phenolic Compounds,
Ind. Eng. Chem. Res., 2008, 47, 15, 5182-5189, https://doi.org/10.1021/ie071452o
. [all data]
Sharma, Jamwal, et al., 2004
Sharma, B.L.; Jamwal, R.; Kant, R.,
Thermodynamic and lamella models relationship for the eutectic system benzoic acid-- cinnamic acid,
Cryst. Res. Technol., 2004, 39, 5, 454-464, https://doi.org/10.1002/crat.200310210
. [all data]
Acree, 1991
Acree, William E.,
Thermodynamic properties of organic compounds: enthalpy of fusion and melting point temperature compilation,
Thermochimica Acta, 1991, 189, 1, 37-56, https://doi.org/10.1016/0040-6031(91)87098-H
. [all data]
Schaldach, 1984
Schaldach, B.,
Chemistry of gaseous ions. Part VIII. Bond strength and mass spectrometric fragmentation of 2-methoxycinnamic acid,
Int. J. Mass Spectrom. Ion Processes, 1984, 56, 237. [all data]