Pyrimidine,5-bromo-2-methoxy-
- Formula: C5H5BrN2O
- Molecular weight: 189.010
- IUPAC Standard InChIKey: DWVCZDMMGYIULX-UHFFFAOYSA-N
- CAS Registry Number: 14001-66-2
- Chemical structure:
View 3d structure (requires JavaScript / HTML 5) - Permanent link for this species. Use this link for bookmarking this species for future reference.

Gas phase ion energetics data

Data compiled by: Sharon G. Lias, Rhoda D. Levin, and Sherif A. Kafafi
Ionization energy determinations
IE (eV) | Method | Reference |
---|---|---|
9.11 ± 0.05 | EI | Gacek, Thorstad, et al., 1978 |

References

Gacek, Thorstad, et al., 1978
Gacek, M.; Thorstad, O.; Ongstad, L.; Undheim, K.,
Ionisation potentials in tautomer analysis of 2-hydroxypyrimidines,
Chem. Scr., 1978, 13, 99. [all data]