zirconium tetraiodide
- Formula: I4Zr
- Molecular weight: 598.842
- CAS Registry Number: 13986-26-0

Gas phase thermochemistry data

Quantity | Value | Units | Method | Reference | Comment |
---|---|---|---|---|---|
ΔfH°gas | -362.33 | kJ/mol | Review | Chase, 1998 | Data last reviewed in June, 1975 |
Quantity | Value | Units | Method | Reference | Comment |
S°gas,1 bar | 446.56 | J/mol*K | Review | Chase, 1998 | Data last reviewed in June, 1975 |
Gas Phase Heat Capacity (Shomate Equation)
Cp° = A + B*t + C*t2 + D*t3 +
E/t2
H° − H°298.15= A*t + B*t2/2 +
C*t3/3 + D*t4/4 − E/t + F − H
S° = A*ln(t) + B*t + C*t2/2 + D*t3/3 −
E/(2*t2) + G
Cp = heat capacity (J/mol*K)
H° = standard enthalpy (kJ/mol)
S° = standard entropy (J/mol*K)
t = temperature (K) / 1000.
View plot Requires a JavaScript / HTML 5 canvas capable browser.
Temperature (K) | 298. to 6000. |
---|---|
A | 107.9945 |
B | 0.079860 |
C | -0.021687 |
D | 0.001852 |
E | -0.306187 |
F | -395.5633 |
G | 575.5050 |
H | -362.3344 |
Reference | Chase, 1998 |
Comment | Data last reviewed in June, 1975 |

Condensed phase thermochemistry data

Quantity | Value | Units | Method | Reference | Comment |
---|---|---|---|---|---|
ΔfH°solid | -488.69 | kJ/mol | Review | Chase, 1998 | Data last reviewed in June, 1975 |
Quantity | Value | Units | Method | Reference | Comment |
S°solid | 260.26 | J/mol*K | Review | Chase, 1998 | Data last reviewed in June, 1975 |
Solid Phase Heat Capacity (Shomate Equation)
Cp° = A + B*t + C*t2 + D*t3 +
E/t2
H° − H°298.15= A*t + B*t2/2 +
C*t3/3 + D*t4/4 − E/t + F − H
S° = A*ln(t) + B*t + C*t2/2 + D*t3/3 −
E/(2*t2) + G
Cp = heat capacity (J/mol*K)
H° = standard enthalpy (kJ/mol)
S° = standard entropy (J/mol*K)
t = temperature (K) / 1000.
View plot Requires a JavaScript / HTML 5 canvas capable browser.
Temperature (K) | 298. to 1000. |
---|---|
A | 127.0944 |
B | 19.61986 |
C | -12.36058 |
D | 5.597397 |
E | -0.372595 |
F | -528.6149 |
G | 406.6149 |
H | -488.6912 |
Reference | Chase, 1998 |
Comment | Data last reviewed in June, 1975 |

Phase change data

Antoine Equation Parameters
log10(P) = A − (B / (T + C))
P = vapor pressure (bar)
T = temperature (K)
View plot Requires a JavaScript / HTML 5 canvas capable browser.
Temperature (K) | A | B | C | Reference | Comment |
---|---|---|---|---|---|
537. to 704. | 8.46456 | 5536.748 | -49.261 | Stull, 1947 | Coefficents calculated by NIST from author's data. |

Gas phase ion energetics data

Data compiled by: Sharon G. Lias, Rhoda D. Levin, and Sherif A. Kafafi
Ionization energy determinations
IE (eV) | Method | Reference | Comment |
---|---|---|---|
9.3 | PE | Egdell and Orchard, 1978 | |
9.55 | PE | Egdell and Orchard, 1978 | Vertical value |

Vibrational and/or electronic energy levels

Data compiled by: Takehiko Shimanouchi
Symmetry: Td Symmetry Number σ = 12
Sym. | No | Approximate | Selected Freq. | Infrared | Raman | Comments | ||||
---|---|---|---|---|---|---|---|---|---|---|
Species | type of mode | Value | Rating | Value | Phase | Value | Phase | |||
a1 | 1 | Sym str | 158 | B | ia | 158 | gas | |||
e | 2 | Deg deform | 43 | B | ia | 43 | gas | |||
f2 | 3 | Deg str | 254 | C | 254 | gas | ||||
f2 | 4 | Deg deform | 55 | C | 55 | gas | ||||
Source: Shimanouchi, 1972

References

Chase, 1998
Chase, M.W., Jr.,
NIST-JANAF Themochemical Tables, Fourth Edition,
J. Phys. Chem. Ref. Data, Monograph 9, 1998, 1-1951. [all data]
Stull, 1947
Stull, Daniel R.,
Vapor Pressure of Pure Substances. Organic and Inorganic Compounds,
Ind. Eng. Chem., 1947, 39, 4, 517-540, https://doi.org/10.1021/ie50448a022
. [all data]
Egdell and Orchard, 1978
Egdell, R.G.; Orchard, A.F.,
Photoelectron spectra of the group IVA halides,
J. Chem. Soc. Faraday Trans. 2, 1978, 74, 485. [all data]
Shimanouchi, 1972
Shimanouchi, T.,
Tables of Molecular Vibrational Frequencies Consolidated Volume II,
J. Phys. Chem. Ref. Data, 1972, 6, 3, 993-1102. [all data]