Manganese, phenyl pentacarbonyl
- Formula: C11H5MnO5
- Molecular weight: 272.0924
- CAS Registry Number: 13985-77-8

Condensed phase thermochemistry data

Data compiled by: José A. Martinho Simões
Quantity | Value | Units | Method | Reference | Comment |
---|---|---|---|---|---|
ΔfH°solid | -672. ± 17. | kJ/mol | Review | Martinho Simões | The enthalpy of formation is the average of the results for five iodination reaction enthalpies |
ΔfH°solid | -673.8 ± 5.5 | kJ/mol | Review | Martinho Simões | Selected data |

Phase change data

Data compiled as indicated in comments:
MS - José A. Martinho Simões
AC - William E. Acree, Jr., James S. Chickos
Quantity | Value | Units | Method | Reference | Comment |
---|---|---|---|---|---|
ΔsubH° | 84.9 ± 4.4 | kJ/mol | HAL-HFC | Connor, Zafarani-Moattar, et al., 1982 | MS |
ΔsubH° | 84.9 ± 4.4 | kJ/mol | C | Connor, Zafarani-Moattar, et al., 1982, 2 | AC |

Gas phase ion energetics data

Data compiled as indicated in comments:
RDSH - Henry M. Rosenstock, Keith Draxl, Bruce W. Steiner, and John T. Herron
Ionization energy determinations
IE (eV) | Method | Reference | Comment |
---|---|---|---|
8.22 ± 0.05 | EI | Junk, Preston, et al., 1970 | RDSH |

Gas phase thermochemistry data

Data compiled by: José A. Martinho Simões
Quantity | Value | Units | Method | Reference | Comment |
---|---|---|---|---|---|
ΔfH°gas | -587. ± 18. | kJ/mol | Review | Martinho Simões | The enthalpy of formation is the average of the results for five iodination reaction enthalpies |
ΔfH°gas | -588.9 ± 7.0 | kJ/mol | Review | Martinho Simões | Selected data |

Reaction thermochemistry data

Data compiled by: José A. Martinho Simões
Individual Reactions
C11H5MnO5 (solution) + (solution) = C12H5MnO6 (solution)
By formula: C11H5MnO5 (solution) + CO (solution) = C12H5MnO6 (solution)
Quantity | Value | Units | Method | Reference | Comment |
---|---|---|---|---|---|
ΔrH° | -45.2 | kJ/mol | EqS | Calderazzo, 1977 | solvent: 2,2'-diethoxydiethyl ether |
C12H5MnO6 (cr) = C11H5MnO5 (g) + (g)
By formula: C12H5MnO6 (cr) = C11H5MnO5 (g) + CO (g)
Quantity | Value | Units | Method | Reference | Comment |
---|---|---|---|---|---|
ΔrH° | 148. ± 3. | kJ/mol | TD-HFC | Connor, Zafarani-Moattar, et al., 1982 |

References

Martinho Simões
Martinho Simões, J.A.,
Private communication (see http://webbook.nist.gov/chemistry/om/). [all data]
Connor, Zafarani-Moattar, et al., 1982
Connor, J.A.; Zafarani-Moattar, M.T.; Bickerton, J.; El-Saied, N.I.; Suradi, S.; Carson, R.; Al Takkhin, G.; Skinner, H.A.,
Organomet., 1982, 1, 1166. [all data]
Connor, Zafarani-Moattar, et al., 1982, 2
Connor, Joseph A.; Zafarani-Moattar, Mohamed T.; Bickerton, James; El Saied, Nabila I.; Suradi, Sukiman; Carson, Ronald; Al Takhin, Ghassan; Skinner, Henry A.,
Enthalpy of formation of acyl-, alkyl- and hydridopentacarbonyl-manganese complexes. The enthalpy contributions of manganese-hydrogen and manganese-carbon bonds in these molecules. Thermochemical aspects of models in Fischer-Tropsch reactions,
Organometallics, 1982, 1, 9, 1166-1174, https://doi.org/10.1021/om00069a011
. [all data]
Junk, Preston, et al., 1970
Junk, G.A.; Preston, F.J.; Svec, H.J.; Thompson, D.T.,
Ligand effects on the ionization potentials and bond energies of some L1L2Fe2(CO)6 complexes,
J. Chem. Soc. A, 1970, 3171. [all data]