Phosphinidene
- Formula: HP
- Molecular weight: 31.98170
- IUPAC Standard InChIKey: BHEPBYXIRTUNPN-UHFFFAOYSA-N
- CAS Registry Number: 13967-14-1
- Chemical structure:
View 3d structure (requires JavaScript / HTML 5) - Permanent link for this species. Use this link for bookmarking this species for future reference.

Gas phase ion energetics data

Data evaluated as indicated in comments:
HL - Edward P. Hunter and Sharon G. Lias
Data compiled as indicated in comments:
B - John E. Bartmess
LL - Sharon G. Lias and Joel F. Liebman
LBLHLM - Sharon G. Lias, John E. Bartmess, Joel F. Liebman, John L. Holmes, Rhoda D. Levin, and W. Gary Mallard
Quantity | Value | Units | Method | Reference | Comment |
---|---|---|---|---|---|
Proton affinity (review) | 670.3 | kJ/mol | N/A | Hunter and Lias, 1998 | HL |
Quantity | Value | Units | Method | Reference | Comment |
Gas basicity | 639.6 | kJ/mol | N/A | Hunter and Lias, 1998 | HL |
Electron affinity determinations
EA (eV) | Method | Reference | Comment |
---|---|---|---|
1.0270 ± 0.0060 | LPES | Ervin and Lineberger, 2005 | B |
1.028 ± 0.010 | LPES | Zittel and Lineberger, 1976 | B |
1.00 ± 0.060 | PD | Rackwitz, Feldman, et al., 1977 | B |
>0.50 ± 0.20 | EIAE | Halmann and Platzner, 1969 | From PH3; B |
<1.09997 | IMRB | Ebinghaus, Kraus, et al., 1964 | B |
Ionization energy determinations
IE (eV) | Method | Reference | Comment |
---|---|---|---|
10.149 ± 0.008 | PI | Berkowitz and Cho, 1988 | LL |
10.2 ± 0.1 | DER | Berkowitz, Curtiss, et al., 1986 | LBLHLM |
De-protonation reactions
P- + =
Quantity | Value | Units | Method | Reference | Comment |
---|---|---|---|---|---|
ΔrH° | 1538. ± 33. | kJ/mol | D-EA | Andersson, Lindahl, et al., 2007 | gas phase; B |
Quantity | Value | Units | Method | Reference | Comment |
ΔrG° | 1515. ± 34. | kJ/mol | H-TS | Andersson, Lindahl, et al., 2007 | gas phase; B |

Gas phase thermochemistry data

Quantity | Value | Units | Method | Reference | Comment |
---|---|---|---|---|---|
ΔfH°gas | 253.55 | kJ/mol | Review | Chase, 1998 | Data last reviewed in June, 1967 |
Quantity | Value | Units | Method | Reference | Comment |
S°gas,1 bar | 196.35 | J/mol*K | Review | Chase, 1998 | Data last reviewed in June, 1967 |
Gas Phase Heat Capacity (Shomate Equation)
Cp° = A + B*t + C*t2 + D*t3 +
E/t2
H° − H°298.15= A*t + B*t2/2 +
C*t3/3 + D*t4/4 − E/t + F − H
S° = A*ln(t) + B*t + C*t2/2 + D*t3/3 −
E/(2*t2) + G
Cp = heat capacity (J/mol*K)
H° = standard enthalpy (kJ/mol)
S° = standard entropy (J/mol*K)
t = temperature (K) / 1000.
View plot Requires a JavaScript / HTML 5 canvas capable browser.
Temperature (K) | 298. to 1200. | 1200. to 6000. |
---|---|---|
A | 28.32196 | 28.54350 |
B | -2.953172 | 6.165836 |
C | 13.45662 | -0.924145 |
D | -5.760950 | 0.055819 |
E | 0.061045 | -0.614789 |
F | 245.3351 | 243.2084 |
G | 231.2974 | 227.0828 |
H | 253.5504 | 253.5504 |
Reference | Chase, 1998 | Chase, 1998 |
Comment | Data last reviewed in June, 1967 | Data last reviewed in June, 1967 |

Reaction thermochemistry data

Data compiled by: John E. Bartmess
Individual Reactions
(CAS Reg. No. 13937-34-3 • 4294967295) +
= CAS Reg. No. 13937-34-3
By formula: (CAS Reg. No. 13937-34-3 • 4294967295HP) + HP = CAS Reg. No. 13937-34-3
Quantity | Value | Units | Method | Reference | Comment |
---|---|---|---|---|---|
ΔrH° | 384. ± 34. | kJ/mol | N/A | Ervin and Lineberger, 2005 | gas phase; High level calcns( Curtiss, Raghavachari, et al., 1991, Ricca and Bauschlicher, 1998) give DH ca. 84 |
ΔrH° | 354. ± 12. | kJ/mol | Ther | Bartmess, Scott, et al., 1979 | gas phase; The D-EA cycle does not close by 7 kcal/mol. The reason for this discrepancy is not known; value altered from reference due to change in acidity scale |
P- + =
Quantity | Value | Units | Method | Reference | Comment |
---|---|---|---|---|---|
ΔrH° | 1538. ± 33. | kJ/mol | D-EA | Andersson, Lindahl, et al., 2007 | gas phase |
Quantity | Value | Units | Method | Reference | Comment |
ΔrG° | 1515. ± 34. | kJ/mol | H-TS | Andersson, Lindahl, et al., 2007 | gas phase |

Constants of diatomic molecules

Data compiled by: Klaus P. Huber and Gerhard H. Herzberg

Data collected through July, 1977

Symbols used in the table of constants
SymbolMeaning
State electronic state and / or symmetry symbol
Te minimum electronic energy (cm-1)
ωe vibrational constant – first term (cm-1)
ωexe vibrational constant – second term (cm-1)
ωeye vibrational constant – third term (cm-1)
Be rotational constant in equilibrium position (cm-1)
αe rotational constant – first term (cm-1)
γe rotation-vibration interaction constant (cm-1)
De centrifugal distortion constant (cm-1)
βe rotational constant – first term, centrifugal force (cm-1)
re internuclear distance (Å)
Trans. observed transition(s) corresponding to electronic state
ν00 position of 0-0 band (units noted in table)
Diatomic constants for 31PH
StateTeωeωexeωeyeBeαeγeDeβereTrans.ν00
d 1Π     [8.478] 1   [4.17E-4]  [1.4273] d ← a 62725.28 Z
missing citation
B 3Π0     [7.3]     [1.54] B ← X R 69587.8 Z
Balfour and Douglas, 1968
c 1Φ     [8.602] 0.21  [5.44E-4]  [1.4170] c ← a 2 61548.68 Z
missing citation
A 3Πi,0+ 29498 3 [1833.78] Z (98.5) 4  [8.0222] 5 6  [5.683E-4] 7  [1.46728] A ↔ X 8 R 29434.61 9
missing citation; missing citation; missing citation; Horani, Rostas, et al., 1967; Rostas, Cossart, et al., 1974
StateTeωeωexeωeyeBeαeγeDeβereTrans.ν00
A 3Πi,0- 29498 3 [1833.39] Z (98.5) 4  [8.0222] 5 6  [5.683E-4] 7  [1.46728] A ↔ X 8 R 29434.28 9
missing citation; missing citation; missing citation; Horani, Rostas, et al., 1967; Rostas, Cossart, et al., 1974
A 3Πi,1 29498 3 [1833.74] Z (98.5) 4  [8.0222] 5 6  [5.683E-4] 7  [1.46728] A ↔ X 8 R 29316.81 9
missing citation; missing citation; missing citation; Horani, Rostas, et al., 1967; Rostas, Cossart, et al., 1974
A 3Πi,2 29498 3 [1834.38] Z (98.5) 4  [8.0222] 5 6  [5.683E-4] 7  [1.46728] A ↔ X 8 R 29203.21 9
missing citation; missing citation; missing citation; Horani, Rostas, et al., 1967; Rostas, Cossart, et al., 1974
b 1Σ+ (15160) 10
StateTeωeωexeωeyeBeαeγeDeβereTrans.ν00
a 1Δ (7660) 10    [8.443] 0.12  [4.18E-4]  [1.4302] 11
Davies, Russell, et al., 1975
X 3Σ- 0 2365.2 12 44.5 12  8.5371 13 0.2514  4.36E-4  1.42234 11
Davies, Russell, et al., 1975

References

Hunter and Lias, 1998
Hunter, E.P.; Lias, S.G.,
Evaluated Gas Phase Basicities and Proton Affinities of Molecules: An Update,
J. Phys. Chem. Ref. Data, 1998, 27, 3, 413-656, https://doi.org/10.1063/1.556018
. [all data]
Ervin and Lineberger, 2005
Ervin, K.M.; Lineberger, W.C.,
Photoelectron spectroscopy of phosphorus hydride anions,
J. Chem. Phys., 2005, 122, 19, 194303, https://doi.org/10.1063/1.1881153
. [all data]
Zittel and Lineberger, 1976
Zittel, P.F.; Lineberger, W.C.,
Laser photoelectron spectrometry of PO-, PH-, and PH2-,
J. Chem. Phys., 1976, 65, 1236. [all data]
Rackwitz, Feldman, et al., 1977
Rackwitz, R.; Feldman, D.; Kaiser, H.J.; Heincke, E.,
Photodetachment bei einigen zweiatomigen negativen hydridionen: BeH-, MgH-, CaH-, ZnH-, PH-, AsH-,
Z. Naturforsch. A:, 1977, 32, 594. [all data]
Halmann and Platzner, 1969
Halmann, M.; Platzner, I.,
Negative Ions Produced by Electron Capture in Phosphine,
J. Phys. Chem., 1969, 73, 12, 4376, https://doi.org/10.1021/j100846a062
. [all data]
Ebinghaus, Kraus, et al., 1964
Ebinghaus, H.; Kraus, K.; Neuert, H.; Muller-Duysing, W.,
Negative Ionen durch Elecktronenresonanzeinfang in PH3, AsH3, und SiH4,
Z. Naturfor., 1964, 19A, 732. [all data]
Berkowitz and Cho, 1988
Berkowitz, J.; Cho, H.,
A photoionization study of PH: PH2 revisited,
J. Chem. Phys., 1988, 90, 1. [all data]
Berkowitz, Curtiss, et al., 1986
Berkowitz, J.; Curtiss, L.; Gibson, S.; Greene, J.; Hillhouse, G.; Pople, J.,
Photoionization mass spectrometric study and Ab initio calculation of ionization and bonding in P-H compounds. Heats of formation, bond energies, and the 3B1-1A1 separation in PH2+,
J. Chem. Phys., 1986, 84, 375. [all data]
Andersson, Lindahl, et al., 2007
Andersson, P.; Lindahl, A.O.; Alfredsson, C.; Rogstrom, L.; Diehl, C.; Pegg, D.J.; Hanstorp, D.,
The electron affinity of phosphorus,
J. Phys. B - Atom. Mol. Opt. Phys., 2007, 40, 20, 4097-4107, https://doi.org/10.1088/0953-4075/40/20/010
. [all data]