indium iodide

Gas phase ion energetics data

Data compiled as indicated in comments:
LL - Sharon G. Lias and Joel F. Liebman
LLK - Sharon G. Lias, Rhoda D. Levin, and Sherif A. Kafafi

Ionization energy determinations

IE (eV) Method Reference Comment
8.6 ± 0.2EIBencze, Marsel, et al., 1993LL
8.50EIBrumleve, Mucklejohn, et al., 1988LL
8.50PEBerkowitz and Dehmer, 1972LLK
8.88PEEgdell and Orchard, 1978Vertical value; LLK

References

Bencze, Marsel, et al., 1993
Bencze, L.; Marsel, J.; Popovic, A.; Lesar, A., Mass spectrometric investigation of the equilibrium gas-phase composition over InI3 at elevated temperatures, Org. Mass Spectrom., 1993, 28, 1570. [all data]

Brumleve, Mucklejohn, et al., 1988
Brumleve, T.R.; Mucklejohn, S.A.; O'Broen, N.W., [Title unavailable] in Proceedings of the Symposium on High Temperature Lamp Chemistry II (E.G. Zubler, editor) Cleveland, Ohio, 1988, 96. [all data]

Berkowitz and Dehmer, 1972
Berkowitz, J.; Dehmer, J.L., Photoelectron spectroscopy of high-temperature vapors. II. Chemical bonding in the Group III monohalides, J. Chem. Phys., 1972, 57, 3194. [all data]

Egdell and Orchard, 1978
Egdell, R.G.; Orchard, A.F., He(II) Photoelectron spectra of indium(I) and thallium(I) halides, J. Chem. Soc. Faraday Trans. 2, 1978, 74, 1179. [all data]