Diphenyl sulfide
- Formula: C12H10S
- Molecular weight: 186.273
- IUPAC Standard InChIKey: LTYMSROWYAPPGB-UHFFFAOYSA-N
- CAS Registry Number: 139-66-2
- Chemical structure:
View 3d structure (requires JavaScript / HTML 5) - Other names: Benzene, 1,1'-thiobis-; Phenyl sulfide; Diphenyl monosulfide; Diphenyl sulphide; Diphenyl thioether; Diphenylmercaptan; Phenylthiobenzene; Diphenylthiamethane; Sulfide, diphenyl; 1,1'-Thiobis(benzene); NSC 4568

Gas phase thermochemistry data

Data compiled by: Hussein Y. Afeefy, Joel F. Liebman, and Stephen E. Stein
Quantity | Value | Units | Method | Reference | Comment |
---|---|---|---|---|---|
ΔfH°gas | 232. ± 3. | kJ/mol | Ccb | Mackle and Mayrick, 1962 |

Condensed phase thermochemistry data

Data compiled as indicated in comments:
ALS - Hussein Y. Afeefy, Joel F. Liebman, and Stephen E. Stein
DH - Eugene S. Domalski and Elizabeth D. Hearing
Quantity | Value | Units | Method | Reference | Comment |
---|---|---|---|---|---|
ΔfH°liquid | 163.8 ± 2.0 | kJ/mol | Ccb | Mackle and Mayrick, 1962 | ALS |
Quantity | Value | Units | Method | Reference | Comment |
ΔcH°liquid | -6916.9 ± 2.0 | kJ/mol | Ccb | Mackle and Mayrick, 1962 | ALS |
Constant pressure heat capacity of liquid
Cp,liquid (J/mol*K) | Temperature (K) | Reference | Comment |
---|---|---|---|
271.1 | 298.5 | Smith and Andrews, 1931 | T = 102 to 298 K. Value is unsmoothed experimental datum.; DH |

Phase change data

Data compiled as indicated in comments:
BS - Robert L. Brown and Stephen E. Stein
TRC - Thermodynamics Research Center, NIST Boulder Laboratories, Chris Muzny director
ALS - Hussein Y. Afeefy, Joel F. Liebman, and Stephen E. Stein
DRB - Donald R. Burgess, Jr.
AC - William E. Acree, Jr., James S. Chickos
Quantity | Value | Units | Method | Reference | Comment |
---|---|---|---|---|---|
Tboil | 569.2 | K | N/A | Weast and Grasselli, 1989 | BS |
Tboil | 569.65 | K | N/A | Perkin, 1896 | Uncertainty assigned by TRC = 0.5 K; TRC |
Quantity | Value | Units | Method | Reference | Comment |
Tfus | 399.4 | K | N/A | Hauptmann and Wladislaw, 1950 | Uncertainty assigned by TRC = 8. K; TRC |
Tfus | 409. | K | N/A | Hauptmann and Wladislaw, 1950 | Uncertainty assigned by TRC = 4. K; TRC |
Tfus | 438. | K | N/A | Hauptmann and Wladislaw, 1950 | Uncertainty assigned by TRC = 10. K; TRC |
Tfus | 247.25 | K | N/A | Smith and Andrews, 1931, 2 | Uncertainty assigned by TRC = 0.5 K; TRC |
Quantity | Value | Units | Method | Reference | Comment |
ΔvapH° | 68. ± 2. | kJ/mol | C | Mackle and Mayrick, 1962 | ALS |
ΔvapH° | 68.2 | kJ/mol | N/A | Mackle and Mayrick, 1962 | DRB |
Enthalpy of vaporization
ΔvapH (kJ/mol) | Temperature (K) | Method | Reference | Comment |
---|---|---|---|---|
60.5 | 384. | N/A | Dykyj, Svoboda, et al., 1999 | Based on data from 369. to 566. K.; AC |
67.3 ± 0.3 | 360. | EB,IP | Steele, Chirico, et al., 1995 | Based on data from 345. to 611. K.; AC |
64.3 ± 0.3 | 400. | EB,IP | Steele, Chirico, et al., 1995 | Based on data from 345. to 611. K.; AC |
61.3 ± 0.3 | 440. | EB,IP | Steele, Chirico, et al., 1995 | Based on data from 345. to 611. K.; AC |
58.3 ± 0.3 | 480. | EB,IP | Steele, Chirico, et al., 1995 | Based on data from 345. to 611. K.; AC |
55.3 ± 0.3 | 520. | EB,IP | Steele, Chirico, et al., 1995 | Based on data from 345. to 611. K.; AC |
52.0 ± 0.3 | 560. | EB,IP | Steele, Chirico, et al., 1995 | Based on data from 345. to 611. K.; AC |
58.2 | 384. | A | Stephenson and Malanowski, 1987 | Based on data from 369. to 566. K. See also Kretschmer and Wiebe, 1949.; AC |
Antoine Equation Parameters
log10(P) = A − (B / (T + C))
P = vapor pressure (bar)
T = temperature (K)
View plot Requires a JavaScript / HTML 5 canvas capable browser.
Temperature (K) | A | B | C | Reference | Comment |
---|---|---|---|---|---|
369.3 to 565.7 | 4.80611 | 2519.224 | -41.188 | Stull, 1947 | Coefficents calculated by NIST from author's data. |
Enthalpy of fusion
ΔfusH (kJ/mol) | Temperature (K) | Method | Reference | Comment |
---|---|---|---|---|
13.98 | 258. | AC | Steele, Chirico, et al., 1995 | Based on data from 5. to 440. K.; AC |

Gas phase ion energetics data

Data evaluated as indicated in comments:
L - Sharon G. Lias
Data compiled as indicated in comments:
LLK - Sharon G. Lias, Rhoda D. Levin, and Sherif A. Kafafi
RDSH - Henry M. Rosenstock, Keith Draxl, Bruce W. Steiner, and John T. Herron
Quantity | Value | Units | Method | Reference | Comment |
---|---|---|---|---|---|
IE (evaluated) | 7.85 ± 0.04 | eV | N/A | N/A | L |
Ionization energy determinations
IE (eV) | Method | Reference | Comment |
---|---|---|---|
7.92 ± 0.01 | PI | Trofimov, Mel'der, et al., 1975 | LLK |
7.8 | PE | Terlouw, Heerma, et al., 1974 | LLK |
8.04 | CTS | Aloisi, Santini, et al., 1974 | LLK |
8.5 ± 0.1 | EI | Henion and Kingston, 1973 | LLK |
7.81 ± 0.03 | PI | Potapov, Kardash, et al., 1972 | LLK |
7.88 ± 0.05 | EI | Distefano, Foffani, et al., 1971 | LLK |
7.88 | EI | Distefano, Foffani, et al., 1971, 2 | LLK |
9.9 ± 0.3 | EI | Gal'perin, Bogolyubov, et al., 1969 | RDSH |
7.88 | PE | Traven', Redchenko, et al., 1981 | Vertical value; LLK |
7.86 | PE | Domelsmith, Munchausen, et al., 1977 | Vertical value; LLK |
Appearance energy determinations
Ion | AE (eV) | Other Products | Method | Reference | Comment |
---|---|---|---|---|---|
C11H10+ | 12.6 ± 0.1 | CS | EI | Henion and Kingston, 1973 | LLK |

Van Den Dool and Kratz RI, non-polar column, temperature ramp

Data compiled by: NIST Mass Spectrometry Data Center, William E. Wallace, director

Column type CapillaryCapillaryCapillaryCapillary
Active phase DB-1DB-1DB-1DB-1
Column length (m) 20.20.20.20.
Carrier gas
Substrate
Column diameter (mm) 0.180.180.180.18
Phase thickness (μm) 0.180.180.180.18
Tstart (C) 60.60.60.60.
Tend (C) 220.220.220.220.
Heat rate (K/min) 8.8.8.8.
Initial hold (min) 3.3.3.3.
Final hold (min) 5.5.5.5.
I 1552.1552.1552.1552.
ReferenceRochat S., de Saint Laumer J.Y., et al., 2007Rochat S., de Saint Laumer J.Y., et al., 2007Rochat S., de Saint Laumer J.Y., et al., 2007Rochat S., de Saint Laumer J.Y., et al., 2007
Comment MSDC-RI MSDC-RI MSDC-RI MSDC-RI

References

Mackle and Mayrick, 1962
Mackle, H.; Mayrick, R.G.,
Studies in thermochemistry of organic sulphides. Part 3.-The gas-phase heats of formation of diphenyl sulphide, dibenzyl sulphide, diphenyl disulphide,4-thia-1-hexene and 4-thia-5,5-dimethyl-1-hexene,
Trans. Faraday Soc., 1962, 58, 238-243. [all data]
Smith and Andrews, 1931
Smith, R.H.; Andrews, D.H.,
Thermal energy studies. II. Phenyl derivatives of metals,
J. Am. Chem. Soc., 1931, 53, 3661-3667. [all data]
Weast and Grasselli, 1989
CRC Handbook of Data on Organic Compounds, 2nd Editon, Weast,R.C and Grasselli, J.G., ed(s)., CRC Press, Inc., Boca Raton, FL, 1989, 1. [all data]
Perkin, 1896
Perkin, W.H.,
LXIX. On Magnetic Rotatory Power, especially of Aromatic Compounds,
J. Chem. Soc., 1896, 69, 1025-1257. [all data]
Hauptmann and Wladislaw, 1950
Hauptmann, H.; Wladislaw, B.,
The Action of Raney Nickel on SUlfur Compounds III. Aromatic Thioesters,
J. Am. Chem. Soc., 1950, 72, 710. [all data]
Smith and Andrews, 1931, 2
Smith, R.H.; Andrews, D.H.,
Thermal Energy Studies II. Phenyl Derivatives of Metals,
J. Am. Chem. Soc., 1931, 53, 3661-7. [all data]
Dykyj, Svoboda, et al., 1999
Dykyj, J.; Svoboda, J.; Wilhoit, R.C.; Frenkel, M.L.; Hall, K.R.,
Vapor Pressure of Chemicals: Part A. Vapor Pressure and Antoine Constants for Hydrocarbons and Sulfur, Selenium, Tellurium and Hydrogen Containing Organic Compounds, Springer, Berlin, 1999, 373. [all data]
Steele, Chirico, et al., 1995
Steele, W.V.; Chirico, R.D.; Cowell, A.B.; Nguyen, A.; Knipmeyer, S.E.,
Possible precursors and products of deep hydrodesulfurization of distillate fuels,
The Journal of Chemical Thermodynamics, 1995, 27, 12, 1407-1428, https://doi.org/10.1006/jcht.1995.0149
. [all data]
Stephenson and Malanowski, 1987
Stephenson, Richard M.; Malanowski, Stanislaw,
Handbook of the Thermodynamics of Organic Compounds, 1987, https://doi.org/10.1007/978-94-009-3173-2
. [all data]
Kretschmer and Wiebe, 1949
Kretschmer, Carl B.; Wiebe, Richard.,
Liquid-Vapor Equilibrium of Ethanol--Toluene Solutions,
J. Am. Chem. Soc., 1949, 71, 5, 1793-1797, https://doi.org/10.1021/ja01173a076
. [all data]
Stull, 1947
Stull, Daniel R.,
Vapor Pressure of Pure Substances. Organic and Inorganic Compounds,
Ind. Eng. Chem., 1947, 39, 4, 517-540, https://doi.org/10.1021/ie50448a022
. [all data]
Trofimov, Mel'der, et al., 1975
Trofimov, B.A.; Mel'der, U.K.; Pikver, R.I.; Vyalykh, E.P.,
Ionization potentials of unsaturated and sulfides the participation of neighboring multiple bonds of heteroatoms in the stabilization of the radical cation,
Teor. Eksp. Khim., 1975, 11, 129. [all data]
Terlouw, Heerma, et al., 1974
Terlouw, J.K.; Heerma, W.; Frintrop, P.C.M.; Dijkstra, G.; Meinema, H.A.,
Electron-impact induced fragmentation of some heterocyclic-tin compounds,
J. Organomet. Chem., 1974, 64, 205. [all data]
Aloisi, Santini, et al., 1974
Aloisi, G.G.; Santini, S.; Sorriso, S.,
Molecular complexes of substituted diphenyl sulphides with π acceptors. Charge transfer spectra and ionization potentials of the donors,
J. Chem. Soc. Faraday Trans. 1, 1974, 70, 1908. [all data]
Henion and Kingston, 1973
Henion, J.D.; Kingston, D.G.I.,
Mass spectrometry of organic compounds. VII. Energetics of substituent isomerization in diphenyl sulfide and diphenyl ether,
J. Am. Chem. Soc., 1973, 95, 8358. [all data]
Potapov, Kardash, et al., 1972
Potapov, V.K.; Kardash, I.E.; Sorokin, V.V.; Sokolov, S.A.; Evlasheva, T.I.,
Photoionization of heteroaromatic compounds,
Khim. Vys. Energ., 1972, 6, 392. [all data]
Distefano, Foffani, et al., 1971
Distefano, G.; Foffani, A.; Innorta, G.; Pignataro, S.,
Mass spectrometric study of transition metal complexes with ligands having nitrogen or sulphur as donor atom,
Adv. Mass Spectrom., 1971, 5, 696. [all data]
Distefano, Foffani, et al., 1971, 2
Distefano, G.; Foffani, A.; Innorta, G.; Pignataro, S.,
Electron impact ionization potentials of some manganese, chromium and tungsten organometallic derivatives,
Int. J. Mass Spectrom. Ion Phys., 1971, 7, 383. [all data]
Gal'perin, Bogolyubov, et al., 1969
Gal'perin, Ya.V.; Bogolyubov, G.M.; Grishin, N.N.; Petrov, A.A.,
Organic derivatives of elements of groups V and VI. VI. Mass spectra of compounds with S-S bonds,
Zh. Obshch. Khim., 1969, 39, 1599, In original 1567. [all data]
Traven', Redchenko, et al., 1981
Traven', V.F.; Redchenko, V.V.; Eismont, M.Y.; Stepanov, B.I.,
Photoelectron spectra and electronic and steric structures of silicon and sulfur-containing analogs of 9,10-dihydroanthracene,
J. Gen. Chem. USSR, 1981, 51, 1099, In original 1297. [all data]
Domelsmith, Munchausen, et al., 1977
Domelsmith, L.N.; Munchausen, L.L.; Houk, K.N.,
Photoelectron spectra of psychotropic drugs. 2. Phenothiazine and related tranquilizers,
J. Am. Chem. Soc., 1977, 99, 6506. [all data]