Diboron tetrafluoride
- Formula: B2F4
- Molecular weight: 97.616
- IUPAC Standard InChIKey: WUWOPJNIAKTBSJ-UHFFFAOYSA-N
- CAS Registry Number: 13965-73-6
- Chemical structure:
View 3d structure (requires JavaScript / HTML 5) - Other names: Difluoroborane; (BF2)2

Gas phase thermochemistry data

Quantity | Value | Units | Method | Reference | Comment |
---|---|---|---|---|---|
ΔfH°gas | -1431.77 | kJ/mol | Review | Chase, 1998 | Data last reviewed in December, 1964 |
Quantity | Value | Units | Method | Reference | Comment |
S°gas,1 bar | 318.47 | J/mol*K | Review | Chase, 1998 | Data last reviewed in December, 1964 |
Gas Phase Heat Capacity (Shomate Equation)
Cp° = A + B*t + C*t2 + D*t3 +
E/t2
H° − H°298.15= A*t + B*t2/2 +
C*t3/3 + D*t4/4 − E/t + F − H
S° = A*ln(t) + B*t + C*t2/2 + D*t3/3 −
E/(2*t2) + G
Cp = heat capacity (J/mol*K)
H° = standard enthalpy (kJ/mol)
S° = standard entropy (J/mol*K)
t = temperature (K) / 1000.
View plot Requires a JavaScript / HTML 5 canvas capable browser.
Temperature (K) | 298. to 1100. | 1100. to 6000. |
---|---|---|
A | 34.06023 | 126.7886 |
B | 199.2735 | 1.160312 |
C | -165.1090 | -0.234030 |
D | 49.80885 | 0.016162 |
E | -0.288278 | -10.08875 |
F | -1450.388 | -1496.362 |
G | 305.5508 | 432.9310 |
H | -1431.765 | -1431.765 |
Reference | Chase, 1998 | Chase, 1998 |
Comment | Data last reviewed in December, 1964 | Data last reviewed in December, 1964 |

Phase change data

Data compiled by: William E. Acree, Jr., James S. Chickos
Enthalpy of sublimation
ΔsubH (kJ/mol) | Temperature (K) | Reference | Comment |
---|---|---|---|
35.5 | 193. | Finch and Schlesinger, 1958 | Based on data from 178. to 209.5 K. |

Gas phase ion energetics data

Data compiled as indicated in comments:
LLK - Sharon G. Lias, Rhoda D. Levin, and Sherif A. Kafafi
RDSH - Henry M. Rosenstock, Keith Draxl, Bruce W. Steiner, and John T. Herron
Ionization energy determinations
IE (eV) | Method | Reference | Comment |
---|---|---|---|
≤12.23 ± 0.06 | PE | Lynaugh, Lloyd, et al., 1972 | LLK |
12.0 ± 0.01 | PI | Dibeler and Liston, 1968 | RDSH |
Appearance energy determinations
Ion | AE (eV) | Other Products | Method | Reference | Comment |
---|---|---|---|---|---|
BF+ | 12.75 ± 0.01 | BF3 | PI | Dibeler and Liston, 1968 | RDSH |
BF2+ | 12.94 ± 0.01 | BF2 | PI | Dibeler and Liston, 1968 | RDSH |
B2F3+ | 15.40 ± 0.01 | F | PI | Dibeler and Liston, 1968 | RDSH |

References

Chase, 1998
Chase, M.W., Jr.,
NIST-JANAF Themochemical Tables, Fourth Edition,
J. Phys. Chem. Ref. Data, Monograph 9, 1998, 1-1951. [all data]
Finch and Schlesinger, 1958
Finch, Arthur; Schlesinger, H.I.,
Diboron Tetrafluoride,
J. Am. Chem. Soc., 1958, 80, 14, 3573-3574, https://doi.org/10.1021/ja01547a020
. [all data]
Lynaugh, Lloyd, et al., 1972
Lynaugh, N.; Lloyd, D.R.; Guest, M.F.; Hall, M.B.; Hillier, I.H.,
Photoelectron studies of boron compounds. Part 4. Experimental and theoretical studies of diboron and tetrachloride diboron tetrafluoride,
J. Chem. Soc. Faraday Trans. 2, 1972, 68. [all data]
Dibeler and Liston, 1968
Dibeler, V.H.; Liston, S.K.,
Mass spectrometric study of photoionization. XII.Boron trifluoride and diboron tetrafluoride,
Inorg. Chem., 1968, 7, 1742. [all data]