Benzenamine, 4,4'-thiobis-
- Formula: C12H12N2S
- Molecular weight: 216.302
- IUPAC Standard InChIKey: ICNFHJVPAJKPHW-UHFFFAOYSA-N
- CAS Registry Number: 139-65-1
- Chemical structure:
View 3d structure (requires JavaScript / HTML 5) - Other names: Aniline, 4,4'-thiodi-; p,p-Thiodianiline; p,p'-Diaminodiphenyl sulfide; Bis(4-aminophenyl) sulfide; Di(p-aminophenyl) sulfide; Thioaniline; Thiodi-p-phenylenediamine; 4,4'-Diaminodiphenyl sulfide; 4,4'-Diaminophenyl sulfide; 4,4'-Thiodianiline; Bis(p-aminophenyl)sulfide; NCI-C01707; Sulfide, bis(p-aminophenyl); 4,4'-Thioaniline; 4,4'-Thiobisbenzenamine; 4,4'-Thiobis(aniline); Bis(p-aminophenyl)sulphide; Bis(4-aminophenyl)sulphide; p,p'-Diaminodiphenyl sulphide; 4,4-Diaminodiphenyl sulphide; 4,4'-Diaminodiphenylsulphide; Di(p-aminophenyl)sulphide; NSC 6191

Gas phase ion energetics data

Data compiled by: Sharon G. Lias, Rhoda D. Levin, and Sherif A. Kafafi
Ionization energy determinations
IE (eV) | Method | Reference |
---|---|---|
6.75 | PI | Pykhtina, Cherednichenko, et al., 1974 |

References

Pykhtina, Cherednichenko, et al., 1974
Pykhtina, E.V.; Cherednichenko, L.V.; Kardash, I.E.; Evlasheva, T.I.; Sorokin, V.V.; Potapov, V.K.; Pravednikov, A.N.,
Ionization potentials of amines and energies of charge transfer bands in the absorption spectra of complexes of 7,7,8,8-tetracyanoquinodimethan,
High Energy Chem., 1974, 8, 257, In original 307. [all data]