sec-Butylamine
- Formula: C4H11N
- Molecular weight: 73.1368
- IUPAC Standard InChIKey: BHRZNVHARXXAHW-UHFFFAOYSA-N
- CAS Registry Number: 13952-84-6
- Chemical structure:
View 3d structure (requires JavaScript / HTML 5) - Species with the same structure:
- Stereoisomers:
- Other names: 2-Butanamine; Butafume; Propylamine, 1-Methyl-; Tutane; 1-Methylpropanamine; 1-Methylpropylamine; 2-Aminobutane; 2-AB; 2-Butylamine; sec-C4H9NH2; sec-Butanamine; Deccotane; Frucote; 2-Aminobutane base; (RS)-2-aminobutane; (RS)-sec-butylamine; Secondary butylamine; NSC 8030; (.+/-.)-sec-Butylamine

Gas phase thermochemistry data

Data compiled as indicated in comments:
ALS - Hussein Y. Afeefy, Joel F. Liebman, and Stephen E. Stein
DRB - Donald R. Burgess, Jr.
Quantity | Value | Units | Method | Reference | Comment |
---|---|---|---|---|---|
ΔfH°gas | -25.4 ± 0.4 | kcal/mol | Ccb | Evans, Fairbrother, et al., 1959 | Heat of formation derived by Cox and Pilcher, 1970; ALS |
ΔfH°gas | -37.17 | kcal/mol | N/A | Lemoult, 1907 | Value computed using ΔfHliquid° value of -187.0 kj/mol from Lemoult, 1907 and ΔvapH° value of 31.5 kj/mol from Evans, Fairbrother, et al., 1959.; DRB |

Condensed phase thermochemistry data

Data compiled by: Hussein Y. Afeefy, Joel F. Liebman, and Stephen E. Stein
Quantity | Value | Units | Method | Reference | Comment |
---|---|---|---|---|---|
ΔfH°liquid | -32.86 ± 0.25 | kcal/mol | Ccb | Evans, Fairbrother, et al., 1959 | Heat of formation derived by Cox and Pilcher, 1970 |
ΔfH°liquid | -44.7 | kcal/mol | Ccb | Lemoult, 1907 | |
Quantity | Value | Units | Method | Reference | Comment |
ΔcH°liquid | -719.08 ± 0.22 | kcal/mol | Ccb | Evans, Fairbrother, et al., 1959 | Heat of formation derived by Cox and Pilcher, 1970 |
ΔcH°liquid | -712.0 | kcal/mol | Ccb | Lemoult, 1907 |

Phase change data

Data compiled as indicated in comments:
BS - Robert L. Brown and Stephen E. Stein
TRC - Thermodynamics Research Center, NIST Boulder Laboratories, Chris Muzny director
AC - William E. Acree, Jr., James S. Chickos
ALS - Hussein Y. Afeefy, Joel F. Liebman, and Stephen E. Stein
DRB - Donald R. Burgess, Jr.
Quantity | Value | Units | Method | Reference | Comment |
---|---|---|---|---|---|
Tboil | 336. | K | N/A | American Tokyo Kasei, 1988 | BS |
Tboil | 336.15 | K | N/A | Holmberg, 1962 | Uncertainty assigned by TRC = 1.5 K; not certain that this was measured; TRC |
Tboil | 336.15 | K | N/A | Schuerch and Huntress, 1949 | Uncertainty assigned by TRC = 2. K; TRC |
Tboil | 336.15 | K | N/A | Sabatier and Mailhe, 1909 | Uncertainty assigned by TRC = 2. K; TRC |
Quantity | Value | Units | Method | Reference | Comment |
Tfus | 168.65 | K | N/A | Timmermans and Mattaar, 1921 | Uncertainty assigned by TRC = 0.6 K; TRC |
Quantity | Value | Units | Method | Reference | Comment |
Tc | 514.3 | K | N/A | Toczylkin. L.S. and Young, 1980 | Uncertainty assigned by TRC = 0.51 K; TRC |
Quantity | Value | Units | Method | Reference | Comment |
Pc | 49.35 | atm | N/A | Toczylkin. L.S. and Young, 1980 | Uncertainty assigned by TRC = 4.9325 atm; Visual; TRC |
Quantity | Value | Units | Method | Reference | Comment |
ΔvapH° | 7.82 ± 0.02 | kcal/mol | C | Majer, Svoboda, et al., 1979 | AC |
ΔvapH° | 7.79 ± 0.02 | kcal/mol | C | Wadsö, Heikkilä, et al., 1969 | AC |
ΔvapH° | 7.80 ± 0.01 | kcal/mol | C | Wadso, 1969 | ALS |
ΔvapH° | 7.5 ± 0.3 | kcal/mol | V | Evans, Fairbrother, et al., 1959 | Heat of formation derived by Cox and Pilcher, 1970; ALS |
ΔvapH° | 7.53 | kcal/mol | N/A | Evans, Fairbrother, et al., 1959 | DRB |
Enthalpy of vaporization
ΔvapH (kcal/mol) | Temperature (K) | Method | Reference | Comment |
---|---|---|---|---|
8.15 | 279. | A | Stephenson and Malanowski, 1987 | Based on data from 264. to 371. K. See also Dykyj, 1971.; AC |
7.74 | 315. | EB | Majer, Svoboda, et al., 1979 | Based on data from 300. to 335. K.; AC |
7.55 ± 0.02 | 313. | C | Majer, Svoboda, et al., 1979 | AC |
7.29 ± 0.02 | 328. | C | Majer, Svoboda, et al., 1979 | AC |
7.03 ± 0.02 | 343. | C | Majer, Svoboda, et al., 1979 | AC |

Reaction thermochemistry data

Data compiled by: Michael M. Meot-Ner (Mautner) and Sharon G. Lias
Individual Reactions
By formula: C3H9Si+ + C4H11N = (C3H9Si+ • C4H11N)
Quantity | Value | Units | Method | Reference | Comment |
---|---|---|---|---|---|
ΔrH° | 57.9 | kcal/mol | PHPMS | Li and Stone, 1990 | gas phase; switching reaction,Thermochemical ladder((CH3)3Si+)C6H5COOC2H5; Wojtyniak and Stone, 1986 |
Quantity | Value | Units | Method | Reference | Comment |
ΔrS° | 39.0 | cal/mol*K | PHPMS | Li and Stone, 1990 | gas phase; switching reaction,Thermochemical ladder((CH3)3Si+)C6H5COOC2H5; Wojtyniak and Stone, 1986 |

Gas phase ion energetics data

Data evaluated as indicated in comments:
HL - Edward P. Hunter and Sharon G. Lias
Data compiled as indicated in comments:
LLK - Sharon G. Lias, Rhoda D. Levin, and Sherif A. Kafafi
RDSH - Henry M. Rosenstock, Keith Draxl, Bruce W. Steiner, and John T. Herron
LL - Sharon G. Lias and Joel F. Liebman
Quantity | Value | Units | Method | Reference | Comment |
---|---|---|---|---|---|
Proton affinity (review) | 222.2 | kcal/mol | N/A | Hunter and Lias, 1998 | HL |
Quantity | Value | Units | Method | Reference | Comment |
Gas basicity | 214.1 | kcal/mol | N/A | Hunter and Lias, 1998 | HL |
Ionization energy determinations
IE (eV) | Method | Reference | Comment |
---|---|---|---|
8.5 ± 0.1 | PE | Aue, Webb, et al., 1976 | LLK |
8.70 | PI | Watanabe, Nakayama, et al., 1962 | RDSH |
Appearance energy determinations
Ion | AE (eV) | Other Products | Method | Reference | Comment |
---|---|---|---|---|---|
C2H6N+ | 9.10 | C2H5 | EI | Holmes, Lossing, et al., 1988 | LL |
C3H8N+ | 9.12 | CH3 | EI | Lossing, Lam, et al., 1981 | LLK |

Ion clustering data

Data compiled by: Michael M. Meot-Ner (Mautner) and Sharon G. Lias
Clustering reactions
By formula: C3H9Si+ + C4H11N = (C3H9Si+ • C4H11N)
Quantity | Value | Units | Method | Reference | Comment |
---|---|---|---|---|---|
ΔrH° | 57.9 | kcal/mol | PHPMS | Li and Stone, 1990 | gas phase; switching reaction,Thermochemical ladder((CH3)3Si+)C6H5COOC2H5; Wojtyniak and Stone, 1986 |
Quantity | Value | Units | Method | Reference | Comment |
ΔrS° | 39.0 | cal/mol*K | PHPMS | Li and Stone, 1990 | gas phase; switching reaction,Thermochemical ladder((CH3)3Si+)C6H5COOC2H5; Wojtyniak and Stone, 1986 |

Normal alkane RI, polar column, custom temperature program

Data compiled by: NIST Mass Spectrometry Data Center, William E. Wallace, director

Column type Capillary
Active phase DB-Wax
Column length (m)
Carrier gas
Substrate
Column diameter (mm)
Phase thickness (μm)
Program not specified
I 864.
ReferencePeng, Yang, et al., 1991
Comment MSDC-RI

Normal alkane RI, non-polar column, isothermal

Data compiled by: NIST Mass Spectrometry Data Center, William E. Wallace, director

Column type Capillary
Active phase OV-101
Column length (m)
Carrier gas
Substrate
Column diameter (mm)
Phase thickness (μm)
Temperature (C) 130.
I 471.
ReferenceQi, Yang, et al., 2000
Comment MSDC-RI

References

Evans, Fairbrother, et al., 1959
Evans, F.W.; Fairbrother, D.M.; Skinner, H.A.,
The heats of combustion of organic compounds of nitrogen Part 3.-Butylamines, and the cis-dimer of nitrosoisobutane,
Trans. Faraday Soc., 1959, 55, 399-403. [all data]
Cox and Pilcher, 1970
Cox, J.D.; Pilcher, G.,
Thermochemistry of Organic and Organometallic Compounds, Academic Press, New York, 1970, 1-636. [all data]
Lemoult, 1907
Lemoult, M.P.,
Recherches theoriques et experimentales sur les chaleurs de combustion et de formation des composes organiques,
Ann. Chim. Phys., 1907, 12, 395-432. [all data]
American Tokyo Kasei, 1988
American Tokyo Kasei,
TCI American Organic Chemical 88/89 Catalog, American Tokyo Kasei, Portland, OR, 1988, 1610. [all data]
Holmberg, 1962
Holmberg, K.E.,
Isotopic Effects in Systems Containing an Amine and Carbon Dioxide,
Acta Chem. Scand., 1962, 16, 2117. [all data]
Schuerch and Huntress, 1949
Schuerch, C.; Huntress, E.H.,
The Schmidt Reaction II. A New Rearangement Obseved during Degradation of Triethylacetic Acid,
J. Am. Chem. Soc., 1949, 71, 2238. [all data]
Sabatier and Mailhe, 1909
Sabatier, P.; Mailhe, A.,
New Applications of the General Method of Hydrogenation with Various Metals,
Ann. Chim. Phys., 1909, 16, 70. [all data]
Timmermans and Mattaar, 1921
Timmermans, J.; Mattaar, J.F.,
Freezing points of orgainic substances VI. New experimental determinations.,
Bull. Soc. Chim. Belg., 1921, 30, 213. [all data]
Toczylkin. L.S. and Young, 1980
Toczylkin. L.S.; Young, C.L.,
Gas-liquid criticl temperatures of mixtures containing electron donors. II. Amine mixtures,
J. Chem. Thermodyn., 1980, 12, 365. [all data]
Majer, Svoboda, et al., 1979
Majer, Vladimír; Svoboda, Václav; Koubek, Josef; Pick, Jirí,
Temperature dependence of heats of vaporization, saturated vapour pressures and cohesive energies for a group of amines,
Collect. Czech. Chem. Commun., 1979, 44, 12, 3521-3528, https://doi.org/10.1135/cccc19793521
. [all data]
Wadsö, Heikkilä, et al., 1969
Wadsö, Ingemar; Heikkilä, Jussi; Beagley, B.; Aalto, Tarja; Werner, Per-Erik; Junggren, Ulf; Lamm, Bo; Samuelsson, Benny,
Enthalpies of Vaporization of Organic Compounds. III. Amines.,
Acta Chem. Scand., 1969, 23, 2061-2064, https://doi.org/10.3891/acta.chem.scand.23-2061
. [all data]
Wadso, 1969
Wadso, I.,
Enthalpies of vaporization of organic compounds,
Acta Chem. Scand., 1969, 23, 2061. [all data]
Stephenson and Malanowski, 1987
Stephenson, Richard M.; Malanowski, Stanislaw,
Handbook of the Thermodynamics of Organic Compounds, 1987, https://doi.org/10.1007/978-94-009-3173-2
. [all data]
Dykyj, 1971
Dykyj, J.,
Petrochemia, 1971, 11, 2, 27. [all data]
Li and Stone, 1990
Li, X.; Stone, A.J.,
Gas-Phase (CH3)3Si+ Affinities of Alkylamines and Proton Affinities of Trimethylsilyl Alkylamines,
Int. J. Mass Spectrom. Ion Proc., 1990, 101, 2-3, 149, https://doi.org/10.1016/0168-1176(90)87008-5
. [all data]
Wojtyniak and Stone, 1986
Wojtyniak, A.C.M.; Stone, A.J.,
A High-Pressure Mass Spectrometric Study of the Bonding of Trimethylsilylium to Oxygen and Aromatic Bases,
Can. J. Chem., 1986, 74, 59. [all data]
Hunter and Lias, 1998
Hunter, E.P.; Lias, S.G.,
Evaluated Gas Phase Basicities and Proton Affinities of Molecules: An Update,
J. Phys. Chem. Ref. Data, 1998, 27, 3, 413-656, https://doi.org/10.1063/1.556018
. [all data]
Aue, Webb, et al., 1976
Aue, D.H.; Webb, H.M.; Bowers, M.T.,
Quantitative proton affinities, ionization potentials, and hydrogen affinities of alkylamines,
J. Am. Chem. Soc., 1976, 98, 311. [all data]
Watanabe, Nakayama, et al., 1962
Watanabe, K.; Nakayama, T.; Mottl, J.,
Ionization potentials of some molecules,
J. Quant. Spectry. Radiative Transfer, 1962, 2, 369. [all data]
Holmes, Lossing, et al., 1988
Holmes, J.L.; Lossing, F.P.; Maccoll, A.,
Heats of formation of alkyl radicals from appearance energies,
J. Am. Chem. Soc., 1988, 110, 7339. [all data]
Lossing, Lam, et al., 1981
Lossing, F.P.; Lam, Y.-T.; Maccoll, A.,
Gas phase heats of formation of alkyl immonium ions,
Can. J. Chem., 1981, 59, 2228. [all data]