1,3-Methano-1H-indene, 2,3-dihydro-
- Formula: C10H10
- Molecular weight: 130.1864
- IUPAC Standard InChIKey: HUXOCLGWKHIXBP-UHFFFAOYSA-N
- CAS Registry Number: 13938-73-3
- Chemical structure:
View 3d structure (requires JavaScript / HTML 5) - Permanent link for this species. Use this link for bookmarking this species for future reference.

Gas phase ion energetics data

Data compiled as indicated in comments:
LBLHLM - Sharon G. Lias, John E. Bartmess, Joel F. Liebman, John L. Holmes, Rhoda D. Levin, and W. Gary Mallard
Ionization energy determinations
IE (eV) | Method | Reference | Comment |
---|---|---|---|
8.26 | EI | Dass and Gross, 1983 | LBLHLM |

References

Dass and Gross, 1983
Dass, C.; Gross, M.L.,
Electrocyclic ring opening of 1-phenylcyclobutene and 3-phenylcyclobutene radical cations,
J. Am. Chem. Soc., 1983, 105, 5724. [all data]