Bis(1-(2-thienyl)-4,4,4-trifluoro-1,3-butanedionato)copper
- Formula: C16H8CuF6O4S2
- Molecular weight: 505.899
- CAS Registry Number: 13928-09-1

Phase change data

Data compiled by: William E. Acree, Jr., James S. Chickos
Quantity | Value | Units | Method | Reference | Comment |
---|---|---|---|---|---|
ΔsubH° | 40.1 ± 1.8 | kcal/mol | C | Ribeiro da Silva and Santos, 2006 |

Gas phase ion energetics data

Data compiled by: Henry M. Rosenstock, Keith Draxl, Bruce W. Steiner, and John T. Herron
Ionization energy determinations
IE (eV) | Method | Reference |
---|---|---|
8.90 ± 0.05 | EI | Reichert and Westmore, 1970 |

References

Ribeiro da Silva and Santos, 2006
Ribeiro da Silva, Manuel A.V.; Santos, Luís M.N.B.F.,
Standard molar enthalpies of formation of copper(II) β-diketonates and monothio-β-diketonates,
The Journal of Chemical Thermodynamics, 2006, 38, 7, 817-824, https://doi.org/10.1016/j.jct.2005.08.017
. [all data]
Reichert and Westmore, 1970
Reichert, C.; Westmore, J.B.,
Mass spectral studies of metal chelates. VI. Mass spectra and appearance potentials of U-diketonates of copper(II),
Can. J. Chem., 1970, 48, 3213. [all data]