Sulfur, diimidodimethyl-
- Formula: C2H8N2S
- Molecular weight: 92.163
- IUPAC Standard InChIKey: YVEUHSWFOYPLLX-UHFFFAOYSA-N
- CAS Registry Number: 13904-95-5
- Chemical structure:
View 3d structure (requires JavaScript / HTML 5) - Permanent link for this species. Use this link for bookmarking this species for future reference.

Gas phase ion energetics data

Data compiled by: Sharon G. Lias, Rhoda D. Levin, and Sherif A. Kafafi
Ionization energy determinations
IE (eV) | Method | Reference | Comment |
---|---|---|---|
8.87 | PE | Solouki, Bock, et al., 1975 | Vertical value |
8.87 | PE | Solouki, Bock, et al., 1972 | Vertical value |

References

Solouki, Bock, et al., 1975
Solouki, B.; Bock, H.; Appel, R.,
Photoelektronenspektren und Molekuleigenschaften, XLV Schwefelsaure-Derivate X2SY2: Alkyl-, Vinyl- und Arylsulfone, Alkylsulfoimide und Sulfurylhalogenide,
Chem. Ber., 1975, 108, 897. [all data]
Solouki, Bock, et al., 1972
Solouki, B.; Bock, H.; Appel, R.,
Sequence of orbitals in sulfones and sulfodiimides,
Angew. Chem. Int. Ed. Engl., 1972, 11, 927. [all data]