Tetrabutyldiphosphine

Gas phase ion energetics data

Data compiled by: Henry M. Rosenstock, Keith Draxl, Bruce W. Steiner, and John T. Herron

Ionization energy determinations

IE (eV) Method Reference
7.1EIBogolyubov, Grishin, et al., 1969

Appearance energy determinations

Ion AE (eV) Other Products MethodReferenceComment
CH4P2+13.8 ± 0.3?EIBogolyubov, Grishin, et al., 1969
CH5P+13.3 ± 0.3?EIBogolyubov, Grishin, et al., 1969
CH5P2+18.0 ± 0.3?EIBogolyubov, Grishin, et al., 1969
C2H5P2+12.6 ± 0.3?EIBogolyubov, Grishin, et al., 1969
C2H6P+17.8 ± 0.3?EIBogolyubov, Grishin, et al., 1969
C2H6P2+12.8 ± 0.3?EIBogolyubov, Grishin, et al., 1969
C3H7P2+12.6 ± 0.3?EIBogolyubov, Grishin, et al., 1969
C3H8P2+11.9 ± 0.3?EIBogolyubov, Grishin, et al., 1969
C4H10P2+12.1 ± 0.3?EIBogolyubov, Grishin, et al., 1969
C4H11P2+13.5 ± 0.3?EIBogolyubov, Grishin, et al., 1969
C4H12P2+12.8 ± 0.3?EIBogolyubov, Grishin, et al., 1969
C5H13P2+9.9 ± 0.3?EIBogolyubov, Grishin, et al., 1969
C6H13P2+11.3 ± 0.3?EIBogolyubov, Grishin, et al., 1969
C7H15P2+14.7 ± 0.3?EIBogolyubov, Grishin, et al., 1969
C7H16P2+9.8 ± 0.3?EIBogolyubov, Grishin, et al., 1969
C7H17P2+12.0 ± 0.3?EIBogolyubov, Grishin, et al., 1969
C8H18P+11.5 ± 0.3?EIBogolyubov, Grishin, et al., 1969
C8H18P2+8.1 ± 0.3?EIBogolyubov, Grishin, et al., 1969
C8H19P2+12.2 ± 0.3?EIBogolyubov, Grishin, et al., 1969
C8H20P2+10.3 ± 0.3?EIBogolyubov, Grishin, et al., 1969
C9H19P2+9.4 ± 0.3?EIBogolyubov, Grishin, et al., 1969
C12H27P2+10.6 ± 0.3?EIBogolyubov, Grishin, et al., 1969
C12H28P2+8.0 ± 0.3?EIBogolyubov, Grishin, et al., 1969
C16H36P2+7.1 ± 0.3?EIBogolyubov, Grishin, et al., 1969
P2H+17.0 ± 0.3?EIBogolyubov, Grishin, et al., 1969
P2H2+15.2 ± 0.3?EIBogolyubov, Grishin, et al., 1969

References

Bogolyubov, Grishin, et al., 1969
Bogolyubov, G.M.; Grishin, N.N.; Petrov, A.A., Organic derivatives of group V and group VI elements. VIII.Mass spectra of phosphines and diphosphines, Zh. Obshch. Khim., 1969, 39, 1808, In original 1772. [all data]