Benzenamine, N,N-dimethyl-4-nitroso-
- Formula: C8H10N2O
- Molecular weight: 150.1778
- IUPAC Standard InChIKey: CMEWLCATCRTSGF-UHFFFAOYSA-N
- CAS Registry Number: 138-89-6
- Chemical structure:
View 3d structure (requires JavaScript / HTML 5) - Other names: Aniline, N,N-dimethyl-p-nitroso-; p-(Dimethylamino)nitrosobenzene; p-(N,N-Dimethylamino)nitrosobenzene; p-Nitroso-N,N-dimethylaniline; Accelerine; Dimethyl(p-nitrosophenyl)amine; N,N-Dimethyl-p-nitrosoaniline; N,N-Dimethyl-4-nitrosoaniline; NDMA; Ultra Brilliant Blue P; 4-(Dimethylamino)nitrosobenzene; 4-Nitroso-N,N-dimethylaniline; 4-Nitrosodimethylaniline; p-Nitroso dimethylaniline; p-Nitrosodimethylanilide; NCI-C01821; Dimethyl-p-nitrosoaniline; Paranitrosodimethylanilide; UN 1369; Vulcaniline; N,N-Dimethyl-4-nitrosobenzenamine; NSC 2775

Gas phase thermochemistry data

Data compiled by: Hussein Y. Afeefy, Joel F. Liebman, and Stephen E. Stein
Quantity | Value | Units | Method | Reference | Comment |
---|---|---|---|---|---|
ΔfH°gas | 185.0 ± 2.3 | kJ/mol | Ccb | Acree, Tucker, et al., 1994 |

Condensed phase thermochemistry data

Data compiled as indicated in comments:
ALS - Hussein Y. Afeefy, Joel F. Liebman, and Stephen E. Stein
DH - Eugene S. Domalski and Elizabeth D. Hearing
Quantity | Value | Units | Method | Reference | Comment |
---|---|---|---|---|---|
ΔfH°solid | 103.0 ± 1.6 | kJ/mol | Ccb | Acree, Tucker, et al., 1994 | ALS |
Quantity | Value | Units | Method | Reference | Comment |
ΔcH°solid | -4680.2 ± 1.2 | kJ/mol | Ccb | Acree, Tucker, et al., 1994 | ALS |
ΔcH°solid | -4703.2 | kJ/mol | Ccb | Swientoslawski, 1910 | ALS |
Constant pressure heat capacity of solid
Cp,solid (J/mol*K) | Temperature (K) | Reference | Comment |
---|---|---|---|
206.7 | 293. | Campbell and Campbell, 1940 | DH |

Phase change data

Data compiled as indicated in comments:
TRC - Thermodynamics Research Center, NIST Boulder Laboratories, Chris Muzny director
ALS - Hussein Y. Afeefy, Joel F. Liebman, and Stephen E. Stein
AC - William E. Acree, Jr., James S. Chickos
Quantity | Value | Units | Method | Reference | Comment |
---|---|---|---|---|---|
Tfus | 358.9 | K | N/A | Curran and Estok, 1950 | Uncertainty assigned by TRC = 0.7 K; TRC |
Quantity | Value | Units | Method | Reference | Comment |
ΔsubH° | 82.0 ± 1.7 | kJ/mol | V | Acree, Tucker, et al., 1994 | ALS |
ΔsubH° | 82.0 ± 1.7 | kJ/mol | ME | Acree, Tucker, et al., 1994 | Based on data from 323. to 334. K.; AC |

Gas phase ion energetics data

Data compiled by: Sharon G. Lias, Rhoda D. Levin, and Sherif A. Kafafi
Ionization energy determinations
IE (eV) | Method | Reference | Comment |
---|---|---|---|
7.2 | PE | Egdell, Green, et al., 1975 | |
7.8 ± 0.1 | PE | Egdell, Green, et al., 1975, 2 | Vertical value |

References

Acree, Tucker, et al., 1994
Acree, W.E.; Tucker, S.A.; Pilcher, G.; Toole, G.,
Enthalpies of combustion of 4-dimethylamino-nitrosobenzene and 4-dimethylaminonitrobenzene,
J. Chem. Thermodyn., 1994, 26, 85-90. [all data]
Swientoslawski, 1910
Swientoslawski, W.,
Thermochemische Untersuchungen der organischen Verbindungen. Dritte Mitteilung. Stickstoffhaltige Verbindungen.,
Z. Phys. Chem., 1910, 72, 49-83. [all data]
Campbell and Campbell, 1940
Campbell, A.N.; Campbell, A.J.R.,
The heats of solution, heats of formation,
specific heats and equilibrium diagrams of certain molecular compounds. J. Am. Chem. Soc., 1940, 62, 291-297. [all data]
Curran and Estok, 1950
Curran, B.C.; Estok, G.K.,
The Stabilization of Highly Polar Resonacne Structures by Hydrogen Bonding I. Electric Moments,
J. Am. Chem. Soc., 1950, 72, 4575. [all data]
Egdell, Green, et al., 1975
Egdell, R.; Green, J.C.; Rao, C.N.R.,
Photoelectron spectra of substituted benzenes,
Chem. Phys. Lett., 1975, 33, 600. [all data]
Egdell, Green, et al., 1975, 2
Egdell, R.; Green, J.C.; Rao, C.N.R.; Gowenlock, B.G.; Pfab, J.,
He(I) photoelectron studies of C-nitroso compounds,
J. Chem. Soc. Faraday Trans. 2, 1975, 988. [all data]
Koerber, et al., 1980
Koerber, S.C., et al.,
Biochemistry, 1980, 19, 731. [all data]