Benzene, 1-methyl-3-(phenylthio)-
- Formula: C13H12S
- Molecular weight: 200.299
- IUPAC Standard InChIKey: ZJVTUKZKUYWJLL-UHFFFAOYSA-N
- CAS Registry Number: 13865-48-0
- Chemical structure:
View 3d structure (requires JavaScript / HTML 5) - Permanent link for this species. Use this link for bookmarking this species for future reference.

Phase change data

Data compiled by: Robert L. Brown and Stephen E. Stein
Quantity | Value | Units | Method | Reference | Comment |
---|---|---|---|---|---|
Tboil | 582.7 | K | N/A | Weast and Grasselli, 1989 |

Gas phase ion energetics data

Data compiled by: Sharon G. Lias, Rhoda D. Levin, and Sherif A. Kafafi
Ionization energy determinations
IE (eV) | Method | Reference |
---|---|---|
7.99 | CTS | Aloisi, Santini, et al., 1974 |

References

Weast and Grasselli, 1989
CRC Handbook of Data on Organic Compounds, 2nd Editon, Weast,R.C and Grasselli, J.G., ed(s)., CRC Press, Inc., Boca Raton, FL, 1989, 1. [all data]
Aloisi, Santini, et al., 1974
Aloisi, G.G.; Santini, S.; Sorriso, S.,
Molecular complexes of substituted diphenyl sulphides with π acceptors. Charge transfer spectra and ionization potentials of the donors,
J. Chem. Soc. Faraday Trans. 1, 1974, 70, 1908. [all data]