Bromine monofluoride
- Formula: BrF
- Molecular weight: 98.902
- IUPAC Standard InChIKey: MZJUGRUTVANEDW-UHFFFAOYSA-N
- CAS Registry Number: 13863-59-7
- Chemical structure:
View 3d structure (requires JavaScript / HTML 5) - Species with the same structure:

Gas phase thermochemistry data

Quantity | Value | Units | Method | Reference | Comment |
---|---|---|---|---|---|
ΔfH°gas | -58.46 | kJ/mol | Review | Chase, 1998 | Data last reviewed in September, 1965 |
Quantity | Value | Units | Method | Reference | Comment |
S°gas,1 bar | 228.93 | J/mol*K | Review | Chase, 1998 | Data last reviewed in September, 1965 |
Gas Phase Heat Capacity (Shomate Equation)
Cp° = A + B*t + C*t2 + D*t3 +
E/t2
H° − H°298.15= A*t + B*t2/2 +
C*t3/3 + D*t4/4 − E/t + F − H
S° = A*ln(t) + B*t + C*t2/2 + D*t3/3 −
E/(2*t2) + G
Cp = heat capacity (J/mol*K)
H° = standard enthalpy (kJ/mol)
S° = standard entropy (J/mol*K)
t = temperature (K) / 1000.
View plot Requires a JavaScript / HTML 5 canvas capable browser.
Temperature (K) | 298. to 6000. |
---|---|
A | 36.45226 |
B | 1.347621 |
C | -0.219220 |
D | 0.018644 |
E | -0.357918 |
F | -70.58952 |
G | 270.6425 |
H | -58.46303 |
Reference | Chase, 1998 |
Comment | Data last reviewed in September, 1965 |

Gas phase ion energetics data

Data compiled as indicated in comments:
LBLHLM - Sharon G. Lias, John E. Bartmess, Joel F. Liebman, John L. Holmes, Rhoda D. Levin, and W. Gary Mallard
LLK - Sharon G. Lias, Rhoda D. Levin, and Sherif A. Kafafi
RDSH - Henry M. Rosenstock, Keith Draxl, Bruce W. Steiner, and John T. Herron
Ionization energy determinations
IE (eV) | Method | Reference | Comment |
---|---|---|---|
11.86 | PE | Dyke, Josland, et al., 1984 | LBLHLM |
11.77 ± 0.01 | PE | Colbourn, Dyke, et al., 1978 | LLK |
12.09 ± 0.01 | PE | DeKock, Higginson, et al., 1972 | LLK |
11.78 ± 0.01 | PE | DeKock, Higginson, et al., 1972 | LLK |
11.8 ± 0.2 | EI | Irsa and Friedman, 1958 | RDSH |

References

Chase, 1998
Chase, M.W., Jr.,
NIST-JANAF Themochemical Tables, Fourth Edition,
J. Phys. Chem. Ref. Data, Monograph 9, 1998, 1-1951. [all data]
Dyke, Josland, et al., 1984
Dyke, J.M.; Josland, G.D.; Snijders, J.G.; Boerrigter, P.M.,
Ionization energies of the diatomic halogens and interhalogens studied with relativistic hartree-fock-slater calculations,
Chem. Phys., 1984, 91, 419. [all data]
Colbourn, Dyke, et al., 1978
Colbourn, E.A.; Dyke, J.M.; Fayad, N.K.; Morris, A.,
The He(I) photoelectron spectra of BrF and IF,
J. Electron Spectrosc. Relat. Phenom., 1978, 14, 443. [all data]
DeKock, Higginson, et al., 1972
DeKock, R.L.; Higginson, B.R.; Lloyd, D.R.; Breeze, A.; Cruickshank, D.W.J.; Armstrong, D.R.,
Photoelectron spectra of halides. V. Experimental theoretical study of the electronic structures of ClF, ClF3, BrF and BrF3,
Mol. Phys., 1972, 24, 1059. [all data]
Irsa and Friedman, 1958
Irsa, A.P.; Friedman, L.,
Mass spectra of halogen fluorides,
J. Inorg. Nucl. Chem., 1958, 6, 77. [all data]