Silanamine, N,N-disilyl-
- Formula: H9NSi3
- Molecular weight: 107.3347
- IUPAC Standard InChIKey: VOSJXMPCFODQAR-UHFFFAOYSA-N
- CAS Registry Number: 13862-16-3
- Chemical structure:
View 3d structure (requires JavaScript / HTML 5) - Permanent link for this species. Use this link for bookmarking this species for future reference.

Gas phase ion energetics data

Data compiled by: Sharon G. Lias, Rhoda D. Levin, and Sherif A. Kafafi
Ionization energy determinations
IE (eV) | Method | Reference | Comment |
---|---|---|---|
9.7 ± 0.1 | PE | Cradock, Ebsworth, et al., 1972 | Vertical value |

References

Cradock, Ebsworth, et al., 1972
Cradock, S.; Ebsworth, E.A.V.; Savage, W.J.; Whiteford, R.A.,
Photoelectron spectra of some methyl, silyl and germyl amines, phosphines and arsines,
J. Chem. Soc. Faraday Trans. 2, 1972, 68, 934. [all data]