Trifluoroamine oxide
- Formula: F3NO
- Molecular weight: 87.0013
- IUPAC Standard InChIKey: UDOZVPVDQKQJAP-UHFFFAOYSA-N
- CAS Registry Number: 13847-65-9
- Chemical structure:
View 3d structure (requires JavaScript / HTML 5) - Other names: Nitrogen fluoride oxide (NF3O); AMOX; Nitrogen Fluoride oxide (F3NO); Trifluoramine oxide; NOF3; NF3O; Nitrogen trifluoride oxide

Gas phase thermochemistry data

Quantity | Value | Units | Method | Reference | Comment |
---|---|---|---|---|---|
ΔfH°gas | -163.18 | kJ/mol | Review | Chase, 1998 | Data last reviewed in June, 1970 |
Quantity | Value | Units | Method | Reference | Comment |
S°gas,1 bar | 278.48 | J/mol*K | Review | Chase, 1998 | Data last reviewed in June, 1970 |
Gas Phase Heat Capacity (Shomate Equation)
Cp° = A + B*t + C*t2 + D*t3 +
E/t2
H° − H°298.15= A*t + B*t2/2 +
C*t3/3 + D*t4/4 − E/t + F − H
S° = A*ln(t) + B*t + C*t2/2 + D*t3/3 −
E/(2*t2) + G
Cp = heat capacity (J/mol*K)
H° = standard enthalpy (kJ/mol)
S° = standard entropy (J/mol*K)
t = temperature (K) / 1000.
View plot Requires a JavaScript / HTML 5 canvas capable browser.
Temperature (K) | 298. to 1100. | 1100. to 6000. |
---|---|---|
A | 46.62733 | 106.6276 |
B | 133.4805 | 0.809993 |
C | -114.5926 | -0.163066 |
D | 35.74341 | 0.011249 |
E | -0.830984 | -6.908035 |
F | -184.8587 | -213.8070 |
G | 295.2151 | 379.5457 |
H | -163.1760 | -163.1760 |
Reference | Chase, 1998 | Chase, 1998 |
Comment | Data last reviewed in June, 1970 | Data last reviewed in June, 1970 |

Phase change data

Data compiled by: William E. Acree, Jr., James S. Chickos
Enthalpy of vaporization
ΔvapH (kJ/mol) | Temperature (K) | Reference |
---|---|---|
16.1 | 116. to 191. | Fox, MacKenzie, et al., 1968 |

Gas phase ion energetics data

Data evaluated as indicated in comments:
L - Sharon G. Lias
Data compiled as indicated in comments:
LLK - Sharon G. Lias, Rhoda D. Levin, and Sherif A. Kafafi
RDSH - Henry M. Rosenstock, Keith Draxl, Bruce W. Steiner, and John T. Herron
Quantity | Value | Units | Method | Reference | Comment |
---|---|---|---|---|---|
IE (evaluated) | 13.31 ± 0.06 | eV | N/A | N/A | L |
Ionization energy determinations
IE (eV) | Method | Reference | Comment |
---|---|---|---|
13.36 ± 0.01 | PE | Basset and Lloyd, 1972 | LLK |
13.26 ± 0.01 | PI | Dibeler and Walker, 1969 | RDSH |
Appearance energy determinations
Ion | AE (eV) | Other Products | Method | Reference | Comment |
---|---|---|---|---|---|
NOF2+ | 13.59 ± 0.01 | F | PI | Dibeler and Walker, 1969 | RDSH |
NO+ | 15.21 ± 0.02 | 3F? | PI | Dibeler and Walker, 1969 | RDSH |

References

Chase, 1998
Chase, M.W., Jr.,
NIST-JANAF Themochemical Tables, Fourth Edition,
J. Phys. Chem. Ref. Data, Monograph 9, 1998, 1-1951. [all data]
Fox, MacKenzie, et al., 1968
Fox, W.B.; MacKenzie, J.S.; McCarthy, E.R.; Holmes, J.R.; Stahl, R.F.; Juurik, R.,
Chemistry of trifluoramine oxide. I. Synthesis and characterization of trifluoramine,
Inorg. Chem., 1968, 7, 10, 2064-2067, https://doi.org/10.1021/ic50068a022
. [all data]
Basset and Lloyd, 1972
Basset, P.J.; Lloyd, D.R.,
Photoelectron spectra of halides. Part III. Trifluorides and oxide trifluorides of nitrogen and phosphorus, and phosphorus oxide trichloride,
J. Chem. Soc. Dalton Trans., 1972, 248. [all data]
Dibeler and Walker, 1969
Dibeler, V.H.; Walker, J.A.,
Mass spectrometric study of photoionization. XIV. Nitrogen trifluoride and trifluoramine oxide,
Inorg. Chem., 1969, 8, 1728. [all data]