Hexafluorodisilane
- Formula: F6Si2
- Molecular weight: 170.1614
- IUPAC Standard InChIKey: SDNBGJALFMSQER-UHFFFAOYSA-N
- CAS Registry Number: 13830-68-7
- Chemical structure:
View 3d structure (requires JavaScript / HTML 5) - Permanent link for this species. Use this link for bookmarking this species for future reference.

Phase change data

Antoine Equation Parameters
log10(P) = A − (B / (T + C))
P = vapor pressure (bar)
T = temperature (K)
View plot Requires a JavaScript / HTML 5 canvas capable browser.
Temperature (K) | A | B | C | Reference | Comment |
---|---|---|---|---|---|
192. to 254.3 | 9.15414 | 2378.47 | 5.576 | Stull, 1947 | Coefficents calculated by NIST from author's data. |

Gas phase ion energetics data

Data compiled as indicated in comments:
LLK - Sharon G. Lias, Rhoda D. Levin, and Sherif A. Kafafi
RDSH - Henry M. Rosenstock, Keith Draxl, Bruce W. Steiner, and John T. Herron
Ionization energy determinations
IE (eV) | Method | Reference | Comment |
---|---|---|---|
13.20 ± 0.02 | PE | Cradock, Ebsworth, et al., 1973 | Vertical value; LLK |
Appearance energy determinations
Ion | AE (eV) | Other Products | Method | Reference | Comment |
---|---|---|---|---|---|
FSi+ | 14.2 ± 0.1 | ? | EI | McDonald, Williams, et al., 1968 | RDSH |
F2Si+ | 13.0 ± 0.1 | ? | EI | McDonald, Williams, et al., 1968 | RDSH |
F3Si+ | 14.3 ± 0.1 | ? | EI | McDonald, Williams, et al., 1968 | RDSH |
F5Si2+ | 12.9 ± 0.1 | F | EI | McDonald, Williams, et al., 1968 | RDSH |

References

Stull, 1947
Stull, Daniel R.,
Vapor Pressure of Pure Substances. Organic and Inorganic Compounds,
Ind. Eng. Chem., 1947, 39, 4, 517-540, https://doi.org/10.1021/ie50448a022
. [all data]
Cradock, Ebsworth, et al., 1973
Cradock, S.; Ebsworth, E.A.V.; Whiteford, R.A.,
Photoelectron spectra of some simple fluorosilanes,
J. Chem. Soc. Dalton Trans., 1973, 22, 2401. [all data]
McDonald, Williams, et al., 1968
McDonald, J.D.; Williams, C.H.; Thompson, J.C.; Margrave, J.L.,
Appearance potentials, ionization potentials and heats of formation for perfluorosilanes and perfluoroborosilanes,
Advan. Chem. Ser., 1968, 72, 261. [all data]