Molybdenum pentafluoride
- Formula: F5Mo
- Molecular weight: 190.95
- CAS Registry Number: 13819-84-6

Gas phase thermochemistry data

Quantity | Value | Units | Method | Reference | Comment |
---|---|---|---|---|---|
ΔfH°gas | -1241.39 | kJ/mol | Review | Chase, 1998 | Data last reviewed in December, 1978 |
Quantity | Value | Units | Method | Reference | Comment |
S°gas,1 bar | 347.52 | J/mol*K | Review | Chase, 1998 | Data last reviewed in December, 1978 |
Gas Phase Heat Capacity (Shomate Equation)
Cp° = A + B*t + C*t2 + D*t3 +
E/t2
H° − H°298.15= A*t + B*t2/2 +
C*t3/3 + D*t4/4 − E/t + F − H
S° = A*ln(t) + B*t + C*t2/2 + D*t3/3 −
E/(2*t2) + G
Cp = heat capacity (J/mol*K)
H° = standard enthalpy (kJ/mol)
S° = standard entropy (J/mol*K)
t = temperature (K) / 1000.
View plot Requires a JavaScript / HTML 5 canvas capable browser.
Temperature (K) | 298. to 6000. |
---|---|
A | 132.6939 |
B | 1.224478 |
C | -0.205483 |
D | 0.014022 |
E | -2.767901 |
F | -1290.279 |
G | 492.1723 |
H | -1241.393 |
Reference | Chase, 1998 |
Comment | Data last reviewed in December, 1978 |

Gas phase ion energetics data

Data compiled as indicated in comments:
LLK - Sharon G. Lias, Rhoda D. Levin, and Sherif A. Kafafi
Ionization energy determinations
IE (eV) | Method | Reference | Comment |
---|---|---|---|
10.5 ± 0.3 | EI | Malkerova, Alikhanyan, et al., 1980 | LLK |
10.8 ± 0.2 | EI | Alikhanyan, Steblevskii, et al., 1978 | LLK |
10.60 ± 0.10 | EI | Hildenbrand, 1976 | LLK |

References

Chase, 1998
Chase, M.W., Jr.,
NIST-JANAF Themochemical Tables, Fourth Edition,
J. Phys. Chem. Ref. Data, Monograph 9, 1998, 1-1951. [all data]
Malkerova, Alikhanyan, et al., 1980
Malkerova, I.P.; Alikhanyan, A.S.; Pervov, V.S.; Butskii, V.D.; Gorgoraki, V.I.,
Heats of formation of molybdenum sulphide fluorides MoSF3 and MoSF4,
Russ. J. Inorg. Chem., 1980, 25, 1145, In original 2067. [all data]
Alikhanyan, Steblevskii, et al., 1978
Alikhanyan, A.S.; Steblevskii, A.V.; Malkerova, I.P.; Pervov, V.S.; Butskii, V.D.; Gorgoraki, V.I.,
Mass spectrometric study of the sublimation of molybdenum trifluoride,
Russ. J. Inorg. Chem., 1978, 23, 814. [all data]
Hildenbrand, 1976
Hildenbrand, D.L.,
Thermochemical studies of the gaseous lower valent fluorides of molybdenum,
J. Chem. Phys., 1976, 65, 614. [all data]