Difluoroiodophosphine
- Formula: F2IP
- Molecular weight: 195.87504
- IUPAC Standard InChIKey: KBMVMROLNNLWIS-UHFFFAOYSA-N
- CAS Registry Number: 13819-11-9
- Chemical structure:
View 3d structure (requires JavaScript / HTML 5) - Permanent link for this species. Use this link for bookmarking this species for future reference.

Gas phase ion energetics data

Data compiled as indicated in comments:
LLK - Sharon G. Lias, Rhoda D. Levin, and Sherif A. Kafafi
LBLHLM - Sharon G. Lias, John E. Bartmess, Joel F. Liebman, John L. Holmes, Rhoda D. Levin, and W. Gary Mallard
Ionization energy determinations
IE (eV) | Method | Reference | Comment |
---|---|---|---|
9.6 ± 0.1 | EI | Dean, Finch, et al., 1974 | LLK |
9.8 | PE | Cradock and Rankin, 1972 | LLK |
10.1 ± 0.1 | PE | Cradock and Rankin, 1972 | Vertical value; LLK |
Appearance energy determinations
Ion | AE (eV) | Other Products | Method | Reference | Comment |
---|---|---|---|---|---|
FP+ | 17.40 ± 0.02 | F+I | PI | Berkowitz, Greene, et al., 1984 | LBLHLM |
F2P+ | 11.17 ± 0.01 | I | PI | Berkowitz, Greene, et al., 1984 | LBLHLM |
F2P+ | 10.8 ± 0.1 | I | EI | Dean, Finch, et al., 1974 | LLK |
I+ | ≤14.00 | PF2 | PI | Berkowitz, Greene, et al., 1984 | LBLHLM |

References

Dean, Finch, et al., 1974
Dean, C.R.S.; Finch, A.; Gardner, P.J.; Payling, D.W.,
Appearance and ionization potentials of ions produced by electron-impact on some phosphorus-fluorine compounds: the phosphorusphorus bond dissociation energy in diphosphorus tetrafluoride,
J. Chem. Soc. Faraday Trans. 1, 1974, 70, 1921. [all data]
Cradock and Rankin, 1972
Cradock, S.; Rankin, D.W.H.,
Photoelectron spectra of PF2H some substituted difluorophosphines,
J. Chem. Soc. Faraday Trans. 2, 1972, 68, 940. [all data]
Berkowitz, Greene, et al., 1984
Berkowitz, J.; Greene, J.P.; Foropoulos, J., Jr.; Neskovic, O.M.,
Bonding and ionization energies of N-F and P-F compounds,
J. Chem. Phys., 1984, 81, 6166. [all data]