Beryllium chloride
- Formula: BeCl
- Molecular weight: 44.465
- IUPAC Standard InChIKey: LDIHXRVGMZWMIW-UHFFFAOYSA-M
- CAS Registry Number: 13814-50-1
- Chemical structure:
View 3d structure (requires JavaScript / HTML 5) - Permanent link for this species. Use this link for bookmarking this species for future reference.

Gas phase thermochemistry data

Quantity | Value | Units | Method | Reference | Comment |
---|---|---|---|---|---|
ΔfH°gas | 60.67 | kJ/mol | Review | Chase, 1998 | Data last reviewed in September, 1966 |
Quantity | Value | Units | Method | Reference | Comment |
S°gas,1 bar | 217.56 | J/mol*K | Review | Chase, 1998 | Data last reviewed in September, 1966 |
Gas Phase Heat Capacity (Shomate Equation)
Cp° = A + B*t + C*t2 + D*t3 +
E/t2
H° − H°298.15= A*t + B*t2/2 +
C*t3/3 + D*t4/4 − E/t + F − H
S° = A*ln(t) + B*t + C*t2/2 + D*t3/3 −
E/(2*t2) + G
Cp = heat capacity (J/mol*K)
H° = standard enthalpy (kJ/mol)
S° = standard entropy (J/mol*K)
t = temperature (K) / 1000.
View plot Requires a JavaScript / HTML 5 canvas capable browser.
Temperature (K) | 298. to 6000. |
---|---|
A | 35.40739 |
B | 2.158723 |
C | -0.530251 |
D | 0.052715 |
E | -0.409965 |
F | 48.64653 |
G | 257.4821 |
H | 60.66800 |
Reference | Chase, 1998 |
Comment | Data last reviewed in September, 1966 |

Gas phase ion energetics data

Data compiled by: Henry M. Rosenstock, Keith Draxl, Bruce W. Steiner, and John T. Herron
Ionization energy determinations
IE (eV) | Method | Reference |
---|---|---|
9.5 ± 0.5 | EI | Hildenbrand and Theard, 1969 |

Constants of diatomic molecules

Data compiled by: Klaus P. Huber and Gerhard H. Herzberg
Data collected through September, 1976
Symbol | Meaning |
---|---|
State | electronic state and / or symmetry symbol |
Te | minimum electronic energy (cm-1) |
ωe | vibrational constant – first term (cm-1) |
ωexe | vibrational constant – second term (cm-1) |
ωeye | vibrational constant – third term (cm-1) |
Be | rotational constant in equilibrium position (cm-1) |
αe | rotational constant – first term (cm-1) |
γe | rotation-vibration interaction constant (cm-1) |
De | centrifugal distortion constant (cm-1) |
βe | rotational constant – first term, centrifugal force (cm-1) |
re | internuclear distance (Å) |
Trans. | observed transition(s) corresponding to electronic state |
ν00 | position of 0-0 band (units noted in table) |
State | Te | ωe | ωexe | ωeye | Be | αe | γe | De | βe | re | Trans. | ν00 |
---|---|---|---|---|---|---|---|---|---|---|---|---|
R shaded emission bands in the region 37900 - 38300 cm-1 Novikov and Tunitskii, 1960 are due to AlCl. Unidentified system (νe = 18686, ωe'=540, ωe"=552 cm-1) in emission Parker, 1934; assignment to BeCl not confirmed. | ||||||||||||
B 2Σ+ | (48773) | [952.5] Z | 1 | 0.7751 2 | 0.0043 | [3.0E-06] 3 | 1.7422 | B → X V | 48827.6 Z | |||
↳missing citation; missing citation | ||||||||||||
A 2Πr | 27992.0 | 822.11 Z | 5.24 | 0.7094 2 | 0.0068 | 0.0000023 | 1.8211 | A ↔ X R | 27979.63 | |||
↳missing citation; missing citation; missing citation | ||||||||||||
X 2Σ+ | 0 | 846.7 Z | 4.85 | 0.7285 | 0.0069 | 0.0000025 | 1.7971 |

References

Chase, 1998
Chase, M.W., Jr.,
NIST-JANAF Themochemical Tables, Fourth Edition,
J. Phys. Chem. Ref. Data, Monograph 9, 1998, 1-1951. [all data]
Hildenbrand and Theard, 1969
Hildenbrand, D.L.; Theard, L.P.,
Mass spectrometric measurement of the dissociation energies of BeCi and BeCl2,
J. Chem. Phys., 1969, 50, 5350. [all data]