Zirconium trifluoride
- Formula: F3Zr
- Molecular weight: 148.219
- CAS Registry Number: 13814-22-7

Gas phase thermochemistry data

Quantity | Value | Units | Method | Reference | Comment |
---|---|---|---|---|---|
ΔfH°gas | -1105.41 | kJ/mol | Review | Chase, 1998 | Data last reviewed in June, 1968 |
Quantity | Value | Units | Method | Reference | Comment |
S°gas,1 bar | 305.74 | J/mol*K | Review | Chase, 1998 | Data last reviewed in June, 1968 |
Gas Phase Heat Capacity (Shomate Equation)
Cp° = A + B*t + C*t2 + D*t3 +
E/t2
H° − H°298.15= A*t + B*t2/2 +
C*t3/3 + D*t4/4 − E/t + F − H
S° = A*ln(t) + B*t + C*t2/2 + D*t3/3 −
E/(2*t2) + G
Cp = heat capacity (J/mol*K)
H° = standard enthalpy (kJ/mol)
S° = standard entropy (J/mol*K)
t = temperature (K) / 1000.
View plot Requires a JavaScript / HTML 5 canvas capable browser.
Temperature (K) | 298. to 1000. | 1000. to 6000. |
---|---|---|
A | 57.10825 | 92.41536 |
B | 69.08956 | -2.938349 |
C | -58.04882 | 0.492653 |
D | 17.63004 | -0.029994 |
E | -0.461031 | -4.663110 |
F | -1126.580 | -1145.178 |
G | 354.0827 | 400.6230 |
H | -1105.413 | -1105.413 |
Reference | Chase, 1998 | Chase, 1998 |
Comment | Data last reviewed in June, 1968 | Data last reviewed in June, 1968 |

Condensed phase thermochemistry data

Quantity | Value | Units | Method | Reference | Comment |
---|---|---|---|---|---|
ΔfH°solid | -1401.64 | kJ/mol | Review | Chase, 1998 | Data last reviewed in June, 1968 |
Quantity | Value | Units | Method | Reference | Comment |
S°solid | 87.85 | J/mol*K | Review | Chase, 1998 | Data last reviewed in June, 1968 |
Solid Phase Heat Capacity (Shomate Equation)
Cp° = A + B*t + C*t2 + D*t3 +
E/t2
H° − H°298.15= A*t + B*t2/2 +
C*t3/3 + D*t4/4 − E/t + F − H
S° = A*ln(t) + B*t + C*t2/2 + D*t3/3 −
E/(2*t2) + G
Cp = heat capacity (J/mol*K)
H° = standard enthalpy (kJ/mol)
S° = standard entropy (J/mol*K)
t = temperature (K) / 1000.
View plot Requires a JavaScript / HTML 5 canvas capable browser.
Temperature (K) | 298. to 1500. |
---|---|
A | 78.13997 |
B | 62.56544 |
C | -41.70465 |
D | 9.458561 |
E | -0.839193 |
F | -1430.192 |
G | 160.8070 |
H | -1401.640 |
Reference | Chase, 1998 |
Comment | Data last reviewed in June, 1968 |

Gas phase ion energetics data

Data compiled by: Henry M. Rosenstock, Keith Draxl, Bruce W. Steiner, and John T. Herron
Ionization energy determinations
IE (eV) | Method | Reference |
---|---|---|
7.5 ± 0.3 | EI | Murad and Hildenbrand, 1966 |

References

Chase, 1998
Chase, M.W., Jr.,
NIST-JANAF Themochemical Tables, Fourth Edition,
J. Phys. Chem. Ref. Data, Monograph 9, 1998, 1-1951. [all data]
Murad and Hildenbrand, 1966
Murad, E.; Hildenbrand, D.L.,
Mass-spectrometric study of the thermodynamic properties of Zr-F species,
J. Chem. Phys., 1966, 45, 4751. [all data]