terbium triiodide
- Formula: I3Tb
- Molecular weight: 539.63876
- CAS Registry Number: 13813-40-6

Gas phase ion energetics data

Data compiled by: Sharon G. Lias, Rhoda D. Levin, and Sherif A. Kafafi
Ionization energy determinations
IE (eV) | Method | Reference |
---|---|---|
9.5 ± 0.2 | EI | Hirayama and Castle, 1973 |
Appearance energy determinations
Ion | AE (eV) | Other Products | Method | Reference | Comment |
---|---|---|---|---|---|
ITb+ | 13.7 ± 0.2 | 2I | EI | Hirayama and Castle, 1973 | |
I2Tb+ | 10.5 ± 0.2 | I | EI | Hirayama and Castle, 1973 | |
Tb+ | 17.6 ± 0.2 | 3I | EI | Hirayama and Castle, 1973 |

References

Hirayama and Castle, 1973
Hirayama, C.; Castle, P.M.,
Mass spectra of rare earth triiodides,
J. Phys. Chem., 1973, 77, 3110. [all data]