lanthanum triiodide

Gas phase ion energetics data

Data compiled as indicated in comments:
LBLHLM - Sharon G. Lias, John E. Bartmess, Joel F. Liebman, John L. Holmes, Rhoda D. Levin, and W. Gary Mallard

Ionization energy determinations

IE (eV) Method Reference Comment
8.8PERuscic, Goodman, et al., 1983LBLHLM
9.62PERuscic, Goodman, et al., 1983Vertical value; LBLHLM

References

Ruscic, Goodman, et al., 1983
Ruscic, B.; Goodman, G.L.; Berkowitz, J., Photoelectron spectra of the lanthanide trihalides and their interpretation, J. Chem. Phys., 1983, 78, 5443. [all data]