Diphosphorous tetrafluoride
- Formula: F4OP2
- Molecular weight: 153.9405
- IUPAC Standard InChIKey: BOCCVSWJBAYVHO-UHFFFAOYSA-N
- CAS Registry Number: 13812-07-2
- Chemical structure:

Gas phase ion energetics data

Data compiled by: Sharon G. Lias, Rhoda D. Levin, and Sherif A. Kafafi
Ionization energy determinations
IE (eV) | Method | Reference | Comment |
---|---|---|---|
11.2 | PE | Cradock and Rankin, 1972 | Vertical value |

References

Cradock and Rankin, 1972
Cradock, S.; Rankin, D.W.H.,
Photoelectron spectra of PF2H some substituted difluorophosphines,
J. Chem. Soc. Faraday Trans. 2, 1972, 68, 940. [all data]