Tetrakis(diethylamino)zirconium
- Formula: C16H40N4Zr
- Molecular weight: 379.740
- CAS Registry Number: 13801-49-5

Gas phase thermochemistry data

Data compiled by: José A. Martinho Simões
Quantity | Value | Units | Method | Reference | Comment |
---|---|---|---|---|---|
ΔfH°gas | -479. ± 18. | kJ/mol | Review | Martinho Simões | The enthalpy of formation relies on -1796. ± 15. kJ/mol for the enthalpy of formation of Zr(O-i-Pr)4(cr) |

Condensed phase thermochemistry data

Data compiled by: José A. Martinho Simões
Quantity | Value | Units | Method | Reference | Comment |
---|---|---|---|---|---|
ΔfH°liquid | -546. ± 16. | kJ/mol | Review | Martinho Simões | The enthalpy of formation relies on -1796. ± 15. kJ/mol for the enthalpy of formation of Zr(O-i-Pr)4(cr) |

Gas phase ion energetics data

Data compiled by: Sharon G. Lias, Rhoda D. Levin, and Sherif A. Kafafi
Ionization energy determinations
IE (eV) | Method | Reference | Comment |
---|---|---|---|
6.76 | PE | Gibbins, Lappert, et al., 1975 | Vertical value |

Phase change data

Data compiled by: José A. Martinho Simões
Quantity | Value | Units | Method | Reference | Comment |
---|---|---|---|---|---|
ΔvapH° | 66.9 ± 8.4 | kJ/mol | RSC | Lappert, Patil, et al., 1975 |

References

Martinho Simões
Martinho Simões, J.A.,
Private communication (see http://webbook.nist.gov/chemistry/om/). [all data]
Gibbins, Lappert, et al., 1975
Gibbins, S.G.; Lappert, M.F.; Pedley, J.B.; Sharp, G.J.,
Bonding studies of transition-metal complexes. Part II. Helium-I photoelectron spectra of homoleptic d0, d1, and d10 tetrakis(dialkylamides) of transition group 4B metals tungsten hexakis(dimethylamide),
J. Chem. Soc. Dalton Trans., 1975, 72. [all data]