Hexathiane
- Formula: S6
- Molecular weight: 192.390
- IUPAC Standard InChIKey: FEXCMMPRRBSCRG-UHFFFAOYSA-N
- CAS Registry Number: 13798-23-7
- Chemical structure:
View 3d structure (requires JavaScript / HTML 5) - Other names: Cyclohexasulfide; Sulfur; Cyclic hexaatomic sulfur; Sulfur, S6; Sulfur hexamer; Cyclohexasulfur

Gas phase thermochemistry data

Quantity | Value | Units | Method | Reference | Comment |
---|---|---|---|---|---|
S°gas,1 bar | 354.07 | J/mol*K | Review | Chase, 1998 | Data last reviewed in September, 1977 |
Gas Phase Heat Capacity (Shomate Equation)
Cp° = A + B*t + C*t2 + D*t3 +
E/t2
H° − H°298.15= A*t + B*t2/2 +
C*t3/3 + D*t4/4 − E/t + F − H
S° = A*ln(t) + B*t + C*t2/2 + D*t3/3 −
E/(2*t2) + G
Cp = heat capacity (J/mol*K)
H° = standard enthalpy (kJ/mol)
S° = standard entropy (J/mol*K)
t = temperature (K) / 1000.
View plot Requires a JavaScript / HTML 5 canvas capable browser.
Temperature (K) | 298. to 6000. |
---|---|
A | 132.1307 |
B | 0.502373 |
C | -0.000086 |
D | 0.000007 |
E | -1.840952 |
F | -45.59179 |
G | 503.4691 |
H | 0.000000 |
Reference | Chase, 1998 |
Comment | Data last reviewed in September, 1977 |

Gas phase ion energetics data

Data compiled as indicated in comments:
LBLHLM - Sharon G. Lias, John E. Bartmess, Joel F. Liebman, John L. Holmes, Rhoda D. Levin, and W. Gary Mallard
RDSH - Henry M. Rosenstock, Keith Draxl, Bruce W. Steiner, and John T. Herron
B - John E. Bartmess
Electron affinity determinations
EA (eV) | Method | Reference | Comment |
---|---|---|---|
3.210 ± 0.070 | LPD | Hunsicker, Jones, et al., 1995 | Vertical Detachment Energy: 3.55 eV. An isomer exists with EA=2.26 eV; B |
Ionization energy determinations
IE (eV) | Method | Reference | Comment |
---|---|---|---|
9.2 ± 0.2 | EI | Rosinger, Grade, et al., 1983 | LBLHLM |
9.00 ± 0.03 | PI | Berkowitz and Lifshitz, 1968 | RDSH |
9.7 ± 0.3 | EI | Berkowitz and Chupka, 1964 | RDSH |
8.5 ± 0.3 | EI | Hagemann, 1962 | RDSH |
Appearance energy determinations
Ion | AE (eV) | Other Products | Method | Reference | Comment |
---|---|---|---|---|---|
S2+ | 12.8 ± 1.0 | ? | EI | Berkowitz and Chupka, 1964 | RDSH |
S3+ | 13.3 ± 0.5 | ? | EI | Berkowitz and Chupka, 1964 | RDSH |
S4+ | 11.94 ± 0.05 | S2 | PI | Berkowitz and Lifshitz, 1968 | RDSH |

Van Den Dool and Kratz RI, non-polar column, custom temperature program

Column type | Active phase | I | Reference | Comment |
---|---|---|---|---|
Capillary | HP-5MS | 1499.2 | Andriamaharavo, 2014 | 30. m/0.25 mm/0.25 μm, He; Program: 60C (1 min) => 5 C/min => 210C => 10 C/min => 280C (15 min) |

References

Chase, 1998
Chase, M.W., Jr.,
NIST-JANAF Themochemical Tables, Fourth Edition,
J. Phys. Chem. Ref. Data, Monograph 9, 1998, 1-1951. [all data]
Hunsicker, Jones, et al., 1995
Hunsicker, S.; Jones, R.O.; Gantefor, G.,
Rings and chains in sulfur cluster anions S- to S-9(-): Theory (simulated annealing) and experiment (photoelectron detachment),
J. Chem. Phys., 1995, 102, 15, 5917, https://doi.org/10.1063/1.469326
. [all data]
Rosinger, Grade, et al., 1983
Rosinger, W.; Grade, M.; Hirschwald, W.,
Detection of ion states of S2 to S8 by electron impact,
Int. J. Mass Spectrom. Ion Processes, 1983, 47, 239. [all data]
Berkowitz and Lifshitz, 1968
Berkowitz, J.; Lifshitz, C.,
Photoionization of high temperature vapors. II. Sulfur molecular species,
J. Chem. Phys., 1968, 48, 4346. [all data]
Berkowitz and Chupka, 1964
Berkowitz, J.; Chupka, W.A.,
Vaporization processes involving sulfur,
J. Chem. Phys., 1964, 40, 287. [all data]
Hagemann, 1962
Hagemann, R.,
Determination de la chaleur de formation de S2O par spectrometrie de masse,
Compt. Rend., 1962, 255, 1102. [all data]
Andriamaharavo, 2014
Andriamaharavo, N.R.,
Retention Data. NIST Mass Spectrometry Data Center., NIST Mass Spectrometry Data Center, 2014. [all data]